{"text_format":"2","workbook":"xlsx","n_sheets":2,"sheets":["Sheet1","Set"],"not_rendered":{"charts":0,"images":0,"macros":0,"external_links":0,"defined_names":5,"comments":0,"pivot_tables":0},"unopened":[],"bounds":{"document_bytes":16777216,"sheet_cells":100000,"run_cost":"one","rows_first":2000,"rows_last":500,"rows_between":2000,"halvings":0,"cell_chars":16384,"cell_head_chars":4096},"cells_cut":0,"cells_raw":0,"read":"whole","date_system":"1900"}

{"sheet":"Sheet1","index":0,"n_rows":2001,"n_cols":16,"rows_kept":2001,"cut":false,"hidden":false,"merged":[]}
[1]
[1,"Obligāts","Obligāts","Obligāts","Obligāts","Obligāts","Obligāts","Obligāts",null,"Obligāts","Obligāts","Obligāts","Nav obligāts","Obligāts","Obligāts"]
[1,"Rēķina datums","Piegādātāja nosauk.\n(kontakta kartiņai jābūt sistēmā)","Piegādātāja Reģ.nr.\n(kontakta kartiņai jābūt sistēmā)","Piegādātāja rēķina numurs (jābūt unikālam šajā sarakstā)","Kopā summa (ar PVN)","PVN summa","Rēķina veids (izvēlies no saraksta)","Rēķina veids value","Valūta","Samaksas termiņš (dienas) Izvēlies no saraksta","Grāmatvedības konts kur grāmatos rēķinu (parasti izmaksu konts)","Objekti","Rindas summa BEZ PVN","PVN likme (izvēlies no saraksta)","PVN kods"]
[null,"01.01.2021","MONEO LATVIA SIA",40103911142,"MRE 19732",89.03,15.45,"Rēķins",{"$f":"IF(H4>0,VLOOKUP(H4,Set!$A$2:$B$4,2,FALSE),\"\")","v":"IREK"},"EUR","10",7111,"ML_ABC",1.73,"Pakalpojumi no ES",{"$f":"IF(O4>0,VLOOKUP(O4,Set!$H$2:$J$16,2,FALSE),\"\")","v":"ESPA"}]
[{"$nulls":8},{"$f":"IF(H5>0,VLOOKUP(H5,Set!$A$2:$B$4,2,FALSE),\"\")","v":""},{"$nulls":6},{"$f":"IF(O5>0,VLOOKUP(O5,Set!$H$2:$J$16,2,FALSE),\"\")","v":""}]
[{"$nulls":8},{"$f":"IF(H6>0,VLOOKUP(H6,Set!$A$2:$B$4,2,FALSE),\"\")","v":""},{"$nulls":6},{"$f":"IF(O6>0,VLOOKUP(O6,Set!$H$2:$J$16,2,FALSE),\"\")","v":""}]
[{"$nulls":8},{"$f":"IF(H7>0,VLOOKUP(H7,Set!$A$2:$B$4,2,FALSE),\"\")","v":""},{"$nulls":6},{"$f":"IF(O7>0,VLOOKUP(O7,Set!$H$2:$J$16,2,FALSE),\"\")","v":""}]
[{"$nulls":8},{"$f":"IF(H8>0,VLOOKUP(H8,Set!$A$2:$B$4,2,FALSE),\"\")","v":""},{"$nulls":6},{"$f":"IF(O8>0,VLOOKUP(O8,Set!$H$2:$J$16,2,FALSE),\"\")","v":""}]
[{"$nulls":8},{"$f":"IF(H9>0,VLOOKUP(H9,Set!$A$2:$B$4,2,FALSE),\"\")","v":""},{"$nulls":6},{"$f":"IF(O9>0,VLOOKUP(O9,Set!$H$2:$J$16,2,FALSE),\"\")","v":""}]
[{"$nulls":8},{"$f":"IF(H10>0,VLOOKUP(H10,Set!$A$2:$B$4,2,FALSE),\"\")","v":""},{"$nulls":6},{"$f":"IF(O10>0,VLOOKUP(O10,Set!$H$2:$J$16,2,FALSE),\"\")","v":""}]
[{"$nulls":8},{"$f":"IF(H11>0,VLOOKUP(H11,Set!$A$2:$B$4,2,FALSE),\"\")","v":""},{"$nulls":6},{"$f":"IF(O11>0,VLOOKUP(O11,Set!$H$2:$J$16,2,FALSE),\"\")","v":""}]
[{"$nulls":8},{"$f":"IF(H12>0,VLOOKUP(H12,Set!$A$2:$B$4,2,FALSE),\"\")","v":""},{"$nulls":6},{"$f":"IF(O12>0,VLOOKUP(O12,Set!$H$2:$J$16,2,FALSE),\"\")","v":""}]
[{"$nulls":8},{"$f":"IF(H13>0,VLOOKUP(H13,Set!$A$2:$B$4,2,FALSE),\"\")","v":""},{"$nulls":6},{"$f":"IF(O13>0,VLOOKUP(O13,Set!$H$2:$J$16,2,FALSE),\"\")","v":""}]
[{"$nulls":8},{"$f":"IF(H14>0,VLOOKUP(H14,Set!$A$2:$B$4,2,FALSE),\"\")","v":""},{"$nulls":6},{"$f":"IF(O14>0,VLOOKUP(O14,Set!$H$2:$J$16,2,FALSE),\"\")","v":""}]
[{"$nulls":8},{"$f":"IF(H15>0,VLOOKUP(H15,Set!$A$2:$B$4,2,FALSE),\"\")","v":""},{"$nulls":6},{"$f":"IF(O15>0,VLOOKUP(O15,Set!$H$2:$J$16,2,FALSE),\"\")","v":""}]
[{"$nulls":8},{"$f":"IF(H16>0,VLOOKUP(H16,Set!$A$2:$B$4,2,FALSE),\"\")","v":""},{"$nulls":6},{"$f":"IF(O16>0,VLOOKUP(O16,Set!$H$2:$J$16,2,FALSE),\"\")","v":""}]
[{"$nulls":8},{"$f":"IF(H17>0,VLOOKUP(H17,Set!$A$2:$B$4,2,FALSE),\"\")","v":""},{"$nulls":6},{"$f":"IF(O17>0,VLOOKUP(O17,Set!$H$2:$J$16,2,FALSE),\"\")","v":""}]
[{"$nulls":8},{"$f":"IF(H18>0,VLOOKUP(H18,Set!$A$2:$B$4,2,FALSE),\"\")","v":""},{"$nulls":6},{"$f":"IF(O18>0,VLOOKUP(O18,Set!$H$2:$J$16,2,FALSE),\"\")","v":""}]
[{"$nulls":8},{"$f":"IF(H19>0,VLOOKUP(H19,Set!$A$2:$B$4,2,FALSE),\"\")","v":""},{"$nulls":6},{"$f":"IF(O19>0,VLOOKUP(O19,Set!$H$2:$J$16,2,FALSE),\"\")","v":""}]
[{"$nulls":8},{"$f":"IF(H20>0,VLOOKUP(H20,Set!$A$2:$B$4,2,FALSE),\"\")","v":""},{"$nulls":6},{"$f":"IF(O20>0,VLOOKUP(O20,Set!$H$2:$J$16,2,FALSE),\"\")","v":""}]
[{"$nulls":8},{"$f":"IF(H21>0,VLOOKUP(H21,Set!$A$2:$B$4,2,FALSE),\"\")","v":""},{"$nulls":6},{"$f":"IF(O21>0,VLOOKUP(O21,Set!$H$2:$J$16,2,FALSE),\"\")","v":""}]
[{"$nulls":8},{"$f":"IF(H22>0,VLOOKUP(H22,Set!$A$2:$B$4,2,FALSE),\"\")","v":""},{"$nulls":6},{"$f":"IF(O22>0,VLOOKUP(O22,Set!$H$2:$J$16,2,FALSE),\"\")","v":""}]
[{"$nulls":8},{"$f":"IF(H23>0,VLOOKUP(H23,Set!$A$2:$B$4,2,FALSE),\"\")","v":""},{"$nulls":6},{"$f":"IF(O23>0,VLOOKUP(O23,Set!$H$2:$J$16,2,FALSE),\"\")","v":""}]
[{"$nulls":8},{"$f":"IF(H24>0,VLOOKUP(H24,Set!$A$2:$B$4,2,FALSE),\"\")","v":""},{"$nulls":6},{"$f":"IF(O24>0,VLOOKUP(O24,Set!$H$2:$J$16,2,FALSE),\"\")","v":""}]
[{"$nulls":8},{"$f":"IF(H25>0,VLOOKUP(H25,Set!$A$2:$B$4,2,FALSE),\"\")","v":""},{"$nulls":6},{"$f":"IF(O25>0,VLOOKUP(O25,Set!$H$2:$J$16,2,FALSE),\"\")","v":""}]
[{"$nulls":8},{"$f":"IF(H26>0,VLOOKUP(H26,Set!$A$2:$B$4,2,FALSE),\"\")","v":""},{"$nulls":6},{"$f":"IF(O26>0,VLOOKUP(O26,Set!$H$2:$J$16,2,FALSE),\"\")","v":""}]
[{"$nulls":8},{"$f":"IF(H27>0,VLOOKUP(H27,Set!$A$2:$B$4,2,FALSE),\"\")","v":""},{"$nulls":6},{"$f":"IF(O27>0,VLOOKUP(O27,Set!$H$2:$J$16,2,FALSE),\"\")","v":""}]
[{"$nulls":8},{"$f":"IF(H28>0,VLOOKUP(H28,Set!$A$2:$B$4,2,FALSE),\"\")","v":""},{"$nulls":6},{"$f":"IF(O28>0,VLOOKUP(O28,Set!$H$2:$J$16,2,FALSE),\"\")","v":""}]
[{"$nulls":8},{"$f":"IF(H29>0,VLOOKUP(H29,Set!$A$2:$B$4,2,FALSE),\"\")","v":""},{"$nulls":6},{"$f":"IF(O29>0,VLOOKUP(O29,Set!$H$2:$J$16,2,FALSE),\"\")","v":""}]
[{"$nulls":8},{"$f":"IF(H30>0,VLOOKUP(H30,Set!$A$2:$B$4,2,FALSE),\"\")","v":""},{"$nulls":6},{"$f":"IF(O30>0,VLOOKUP(O30,Set!$H$2:$J$16,2,FALSE),\"\")","v":""}]
[{"$nulls":8},{"$f":"IF(H31>0,VLOOKUP(H31,Set!$A$2:$B$4,2,FALSE),\"\")","v":""},{"$nulls":6},{"$f":"IF(O31>0,VLOOKUP(O31,Set!$H$2:$J$16,2,FALSE),\"\")","v":""}]
[{"$nulls":8},{"$f":"IF(H32>0,VLOOKUP(H32,Set!$A$2:$B$4,2,FALSE),\"\")","v":""},{"$nulls":6},{"$f":"IF(O32>0,VLOOKUP(O32,Set!$H$2:$J$16,2,FALSE),\"\")","v":""}]
[{"$nulls":8},{"$f":"IF(H33>0,VLOOKUP(H33,Set!$A$2:$B$4,2,FALSE),\"\")","v":""},{"$nulls":6},{"$f":"IF(O33>0,VLOOKUP(O33,Set!$H$2:$J$16,2,FALSE),\"\")","v":""}]
[{"$nulls":8},{"$f":"IF(H34>0,VLOOKUP(H34,Set!$A$2:$B$4,2,FALSE),\"\")","v":""},{"$nulls":6},{"$f":"IF(O34>0,VLOOKUP(O34,Set!$H$2:$J$16,2,FALSE),\"\")","v":""}]
[{"$nulls":8},{"$f":"IF(H35>0,VLOOKUP(H35,Set!$A$2:$B$4,2,FALSE),\"\")","v":""},{"$nulls":6},{"$f":"IF(O35>0,VLOOKUP(O35,Set!$H$2:$J$16,2,FALSE),\"\")","v":""}]
[{"$nulls":8},{"$f":"IF(H36>0,VLOOKUP(H36,Set!$A$2:$B$4,2,FALSE),\"\")","v":""},{"$nulls":6},{"$f":"IF(O36>0,VLOOKUP(O36,Set!$H$2:$J$16,2,FALSE),\"\")","v":""}]
[{"$nulls":8},{"$f":"IF(H37>0,VLOOKUP(H37,Set!$A$2:$B$4,2,FALSE),\"\")","v":""},{"$nulls":6},{"$f":"IF(O37>0,VLOOKUP(O37,Set!$H$2:$J$16,2,FALSE),\"\")","v":""}]
[{"$nulls":8},{"$f":"IF(H38>0,VLOOKUP(H38,Set!$A$2:$B$4,2,FALSE),\"\")","v":""},{"$nulls":6},{"$f":"IF(O38>0,VLOOKUP(O38,Set!$H$2:$J$16,2,FALSE),\"\")","v":""}]
[{"$nulls":8},{"$f":"IF(H39>0,VLOOKUP(H39,Set!$A$2:$B$4,2,FALSE),\"\")","v":""},{"$nulls":6},{"$f":"IF(O39>0,VLOOKUP(O39,Set!$H$2:$J$16,2,FALSE),\"\")","v":""}]
[{"$nulls":8},{"$f":"IF(H40>0,VLOOKUP(H40,Set!$A$2:$B$4,2,FALSE),\"\")","v":""},{"$nulls":6},{"$f":"IF(O40>0,VLOOKUP(O40,Set!$H$2:$J$16,2,FALSE),\"\")","v":""}]
[{"$nulls":8},{"$f":"IF(H41>0,VLOOKUP(H41,Set!$A$2:$B$4,2,FALSE),\"\")","v":""},{"$nulls":6},{"$f":"IF(O41>0,VLOOKUP(O41,Set!$H$2:$J$16,2,FALSE),\"\")","v":""}]
[{"$nulls":8},{"$f":"IF(H42>0,VLOOKUP(H42,Set!$A$2:$B$4,2,FALSE),\"\")","v":""},{"$nulls":6},{"$f":"IF(O42>0,VLOOKUP(O42,Set!$H$2:$J$16,2,FALSE),\"\")","v":""}]
[{"$nulls":8},{"$f":"IF(H43>0,VLOOKUP(H43,Set!$A$2:$B$4,2,FALSE),\"\")","v":""},{"$nulls":6},{"$f":"IF(O43>0,VLOOKUP(O43,Set!$H$2:$J$16,2,FALSE),\"\")","v":""}]
[{"$nulls":8},{"$f":"IF(H44>0,VLOOKUP(H44,Set!$A$2:$B$4,2,FALSE),\"\")","v":""},{"$nulls":6},{"$f":"IF(O44>0,VLOOKUP(O44,Set!$H$2:$J$16,2,FALSE),\"\")","v":""}]
[{"$nulls":8},{"$f":"IF(H45>0,VLOOKUP(H45,Set!$A$2:$B$4,2,FALSE),\"\")","v":""},{"$nulls":6},{"$f":"IF(O45>0,VLOOKUP(O45,Set!$H$2:$J$16,2,FALSE),\"\")","v":""}]
[{"$nulls":8},{"$f":"IF(H46>0,VLOOKUP(H46,Set!$A$2:$B$4,2,FALSE),\"\")","v":""},{"$nulls":6},{"$f":"IF(O46>0,VLOOKUP(O46,Set!$H$2:$J$16,2,FALSE),\"\")","v":""}]
[{"$nulls":8},{"$f":"IF(H47>0,VLOOKUP(H47,Set!$A$2:$B$4,2,FALSE),\"\")","v":""},{"$nulls":6},{"$f":"IF(O47>0,VLOOKUP(O47,Set!$H$2:$J$16,2,FALSE),\"\")","v":""}]
[{"$nulls":8},{"$f":"IF(H48>0,VLOOKUP(H48,Set!$A$2:$B$4,2,FALSE),\"\")","v":""},{"$nulls":6},{"$f":"IF(O48>0,VLOOKUP(O48,Set!$H$2:$J$16,2,FALSE),\"\")","v":""}]
[{"$nulls":8},{"$f":"IF(H49>0,VLOOKUP(H49,Set!$A$2:$B$4,2,FALSE),\"\")","v":""},{"$nulls":6},{"$f":"IF(O49>0,VLOOKUP(O49,Set!$H$2:$J$16,2,FALSE),\"\")","v":""}]
[{"$nulls":8},{"$f":"IF(H50>0,VLOOKUP(H50,Set!$A$2:$B$4,2,FALSE),\"\")","v":""},{"$nulls":6},{"$f":"IF(O50>0,VLOOKUP(O50,Set!$H$2:$J$16,2,FALSE),\"\")","v":""}]
[{"$nulls":8},{"$f":"IF(H51>0,VLOOKUP(H51,Set!$A$2:$B$4,2,FALSE),\"\")","v":""},{"$nulls":6},{"$f":"IF(O51>0,VLOOKUP(O51,Set!$H$2:$J$16,2,FALSE),\"\")","v":""}]
[{"$nulls":8},{"$f":"IF(H52>0,VLOOKUP(H52,Set!$A$2:$B$4,2,FALSE),\"\")","v":""},{"$nulls":6},{"$f":"IF(O52>0,VLOOKUP(O52,Set!$H$2:$J$16,2,FALSE),\"\")","v":""}]
[{"$nulls":8},{"$f":"IF(H53>0,VLOOKUP(H53,Set!$A$2:$B$4,2,FALSE),\"\")","v":""},{"$nulls":6},{"$f":"IF(O53>0,VLOOKUP(O53,Set!$H$2:$J$16,2,FALSE),\"\")","v":""}]
[{"$nulls":8},{"$f":"IF(H54>0,VLOOKUP(H54,Set!$A$2:$B$4,2,FALSE),\"\")","v":""},{"$nulls":6},{"$f":"IF(O54>0,VLOOKUP(O54,Set!$H$2:$J$16,2,FALSE),\"\")","v":""}]
[{"$nulls":8},{"$f":"IF(H55>0,VLOOKUP(H55,Set!$A$2:$B$4,2,FALSE),\"\")","v":""},{"$nulls":6},{"$f":"IF(O55>0,VLOOKUP(O55,Set!$H$2:$J$16,2,FALSE),\"\")","v":""}]
[{"$nulls":8},{"$f":"IF(H56>0,VLOOKUP(H56,Set!$A$2:$B$4,2,FALSE),\"\")","v":""},{"$nulls":6},{"$f":"IF(O56>0,VLOOKUP(O56,Set!$H$2:$J$16,2,FALSE),\"\")","v":""}]
[{"$nulls":8},{"$f":"IF(H57>0,VLOOKUP(H57,Set!$A$2:$B$4,2,FALSE),\"\")","v":""},{"$nulls":6},{"$f":"IF(O57>0,VLOOKUP(O57,Set!$H$2:$J$16,2,FALSE),\"\")","v":""}]
[{"$nulls":8},{"$f":"IF(H58>0,VLOOKUP(H58,Set!$A$2:$B$4,2,FALSE),\"\")","v":""},{"$nulls":6},{"$f":"IF(O58>0,VLOOKUP(O58,Set!$H$2:$J$16,2,FALSE),\"\")","v":""}]
[{"$nulls":8},{"$f":"IF(H59>0,VLOOKUP(H59,Set!$A$2:$B$4,2,FALSE),\"\")","v":""},{"$nulls":6},{"$f":"IF(O59>0,VLOOKUP(O59,Set!$H$2:$J$16,2,FALSE),\"\")","v":""}]
[{"$nulls":8},{"$f":"IF(H60>0,VLOOKUP(H60,Set!$A$2:$B$4,2,FALSE),\"\")","v":""},{"$nulls":6},{"$f":"IF(O60>0,VLOOKUP(O60,Set!$H$2:$J$16,2,FALSE),\"\")","v":""}]
[{"$nulls":8},{"$f":"IF(H61>0,VLOOKUP(H61,Set!$A$2:$B$4,2,FALSE),\"\")","v":""},{"$nulls":6},{"$f":"IF(O61>0,VLOOKUP(O61,Set!$H$2:$J$16,2,FALSE),\"\")","v":""}]
[{"$nulls":8},{"$f":"IF(H62>0,VLOOKUP(H62,Set!$A$2:$B$4,2,FALSE),\"\")","v":""},{"$nulls":6},{"$f":"IF(O62>0,VLOOKUP(O62,Set!$H$2:$J$16,2,FALSE),\"\")","v":""}]
[{"$nulls":8},{"$f":"IF(H63>0,VLOOKUP(H63,Set!$A$2:$B$4,2,FALSE),\"\")","v":""},{"$nulls":6},{"$f":"IF(O63>0,VLOOKUP(O63,Set!$H$2:$J$16,2,FALSE),\"\")","v":""}]
[{"$nulls":8},{"$f":"IF(H64>0,VLOOKUP(H64,Set!$A$2:$B$4,2,FALSE),\"\")","v":""},{"$nulls":6},{"$f":"IF(O64>0,VLOOKUP(O64,Set!$H$2:$J$16,2,FALSE),\"\")","v":""}]
[{"$nulls":8},{"$f":"IF(H65>0,VLOOKUP(H65,Set!$A$2:$B$4,2,FALSE),\"\")","v":""},{"$nulls":6},{"$f":"IF(O65>0,VLOOKUP(O65,Set!$H$2:$J$16,2,FALSE),\"\")","v":""}]
[{"$nulls":8},{"$f":"IF(H66>0,VLOOKUP(H66,Set!$A$2:$B$4,2,FALSE),\"\")","v":""},{"$nulls":6},{"$f":"IF(O66>0,VLOOKUP(O66,Set!$H$2:$J$16,2,FALSE),\"\")","v":""}]
[{"$nulls":8},{"$f":"IF(H67>0,VLOOKUP(H67,Set!$A$2:$B$4,2,FALSE),\"\")","v":""},{"$nulls":6},{"$f":"IF(O67>0,VLOOKUP(O67,Set!$H$2:$J$16,2,FALSE),\"\")","v":""}]
[{"$nulls":8},{"$f":"IF(H68>0,VLOOKUP(H68,Set!$A$2:$B$4,2,FALSE),\"\")","v":""},{"$nulls":6},{"$f":"IF(O68>0,VLOOKUP(O68,Set!$H$2:$J$16,2,FALSE),\"\")","v":""}]
[{"$nulls":8},{"$f":"IF(H69>0,VLOOKUP(H69,Set!$A$2:$B$4,2,FALSE),\"\")","v":""},{"$nulls":6},{"$f":"IF(O69>0,VLOOKUP(O69,Set!$H$2:$J$16,2,FALSE),\"\")","v":""}]
[{"$nulls":8},{"$f":"IF(H70>0,VLOOKUP(H70,Set!$A$2:$B$4,2,FALSE),\"\")","v":""},{"$nulls":6},{"$f":"IF(O70>0,VLOOKUP(O70,Set!$H$2:$J$16,2,FALSE),\"\")","v":""}]
[{"$nulls":8},{"$f":"IF(H71>0,VLOOKUP(H71,Set!$A$2:$B$4,2,FALSE),\"\")","v":""},{"$nulls":6},{"$f":"IF(O71>0,VLOOKUP(O71,Set!$H$2:$J$16,2,FALSE),\"\")","v":""}]
[{"$nulls":8},{"$f":"IF(H72>0,VLOOKUP(H72,Set!$A$2:$B$4,2,FALSE),\"\")","v":""},{"$nulls":6},{"$f":"IF(O72>0,VLOOKUP(O72,Set!$H$2:$J$16,2,FALSE),\"\")","v":""}]
[{"$nulls":8},{"$f":"IF(H73>0,VLOOKUP(H73,Set!$A$2:$B$4,2,FALSE),\"\")","v":""},{"$nulls":6},{"$f":"IF(O73>0,VLOOKUP(O73,Set!$H$2:$J$16,2,FALSE),\"\")","v":""}]
[{"$nulls":8},{"$f":"IF(H74>0,VLOOKUP(H74,Set!$A$2:$B$4,2,FALSE),\"\")","v":""},{"$nulls":6},{"$f":"IF(O74>0,VLOOKUP(O74,Set!$H$2:$J$16,2,FALSE),\"\")","v":""}]
[{"$nulls":8},{"$f":"IF(H75>0,VLOOKUP(H75,Set!$A$2:$B$4,2,FALSE),\"\")","v":""},{"$nulls":6},{"$f":"IF(O75>0,VLOOKUP(O75,Set!$H$2:$J$16,2,FALSE),\"\")","v":""}]
[{"$nulls":8},{"$f":"IF(H76>0,VLOOKUP(H76,Set!$A$2:$B$4,2,FALSE),\"\")","v":""},{"$nulls":6},{"$f":"IF(O76>0,VLOOKUP(O76,Set!$H$2:$J$16,2,FALSE),\"\")","v":""}]
[{"$nulls":8},{"$f":"IF(H77>0,VLOOKUP(H77,Set!$A$2:$B$4,2,FALSE),\"\")","v":""},{"$nulls":6},{"$f":"IF(O77>0,VLOOKUP(O77,Set!$H$2:$J$16,2,FALSE),\"\")","v":""}]
[{"$nulls":8},{"$f":"IF(H78>0,VLOOKUP(H78,Set!$A$2:$B$4,2,FALSE),\"\")","v":""},{"$nulls":6},{"$f":"IF(O78>0,VLOOKUP(O78,Set!$H$2:$J$16,2,FALSE),\"\")","v":""}]
[{"$nulls":8},{"$f":"IF(H79>0,VLOOKUP(H79,Set!$A$2:$B$4,2,FALSE),\"\")","v":""},{"$nulls":6},{"$f":"IF(O79>0,VLOOKUP(O79,Set!$H$2:$J$16,2,FALSE),\"\")","v":""}]
[{"$nulls":8},{"$f":"IF(H80>0,VLOOKUP(H80,Set!$A$2:$B$4,2,FALSE),\"\")","v":""},{"$nulls":6},{"$f":"IF(O80>0,VLOOKUP(O80,Set!$H$2:$J$16,2,FALSE),\"\")","v":""}]
[{"$nulls":8},{"$f":"IF(H81>0,VLOOKUP(H81,Set!$A$2:$B$4,2,FALSE),\"\")","v":""},{"$nulls":6},{"$f":"IF(O81>0,VLOOKUP(O81,Set!$H$2:$J$16,2,FALSE),\"\")","v":""}]
[{"$nulls":8},{"$f":"IF(H82>0,VLOOKUP(H82,Set!$A$2:$B$4,2,FALSE),\"\")","v":""},{"$nulls":6},{"$f":"IF(O82>0,VLOOKUP(O82,Set!$H$2:$J$16,2,FALSE),\"\")","v":""}]
[{"$nulls":8},{"$f":"IF(H83>0,VLOOKUP(H83,Set!$A$2:$B$4,2,FALSE),\"\")","v":""},{"$nulls":6},{"$f":"IF(O83>0,VLOOKUP(O83,Set!$H$2:$J$16,2,FALSE),\"\")","v":""}]
[{"$nulls":8},{"$f":"IF(H84>0,VLOOKUP(H84,Set!$A$2:$B$4,2,FALSE),\"\")","v":""},{"$nulls":6},{"$f":"IF(O84>0,VLOOKUP(O84,Set!$H$2:$J$16,2,FALSE),\"\")","v":""}]
[{"$nulls":8},{"$f":"IF(H85>0,VLOOKUP(H85,Set!$A$2:$B$4,2,FALSE),\"\")","v":""},{"$nulls":6},{"$f":"IF(O85>0,VLOOKUP(O85,Set!$H$2:$J$16,2,FALSE),\"\")","v":""}]
[{"$nulls":8},{"$f":"IF(H86>0,VLOOKUP(H86,Set!$A$2:$B$4,2,FALSE),\"\")","v":""},{"$nulls":6},{"$f":"IF(O86>0,VLOOKUP(O86,Set!$H$2:$J$16,2,FALSE),\"\")","v":""}]
[{"$nulls":8},{"$f":"IF(H87>0,VLOOKUP(H87,Set!$A$2:$B$4,2,FALSE),\"\")","v":""},{"$nulls":6},{"$f":"IF(O87>0,VLOOKUP(O87,Set!$H$2:$J$16,2,FALSE),\"\")","v":""}]
[{"$nulls":8},{"$f":"IF(H88>0,VLOOKUP(H88,Set!$A$2:$B$4,2,FALSE),\"\")","v":""},{"$nulls":6},{"$f":"IF(O88>0,VLOOKUP(O88,Set!$H$2:$J$16,2,FALSE),\"\")","v":""}]
[{"$nulls":8},{"$f":"IF(H89>0,VLOOKUP(H89,Set!$A$2:$B$4,2,FALSE),\"\")","v":""},{"$nulls":6},{"$f":"IF(O89>0,VLOOKUP(O89,Set!$H$2:$J$16,2,FALSE),\"\")","v":""}]
[{"$nulls":8},{"$f":"IF(H90>0,VLOOKUP(H90,Set!$A$2:$B$4,2,FALSE),\"\")","v":""},{"$nulls":6},{"$f":"IF(O90>0,VLOOKUP(O90,Set!$H$2:$J$16,2,FALSE),\"\")","v":""}]
[{"$nulls":8},{"$f":"IF(H91>0,VLOOKUP(H91,Set!$A$2:$B$4,2,FALSE),\"\")","v":""},{"$nulls":6},{"$f":"IF(O91>0,VLOOKUP(O91,Set!$H$2:$J$16,2,FALSE),\"\")","v":""}]
[{"$nulls":8},{"$f":"IF(H92>0,VLOOKUP(H92,Set!$A$2:$B$4,2,FALSE),\"\")","v":""},{"$nulls":6},{"$f":"IF(O92>0,VLOOKUP(O92,Set!$H$2:$J$16,2,FALSE),\"\")","v":""}]
[{"$nulls":8},{"$f":"IF(H93>0,VLOOKUP(H93,Set!$A$2:$B$4,2,FALSE),\"\")","v":""},{"$nulls":6},{"$f":"IF(O93>0,VLOOKUP(O93,Set!$H$2:$J$16,2,FALSE),\"\")","v":""}]
[{"$nulls":8},{"$f":"IF(H94>0,VLOOKUP(H94,Set!$A$2:$B$4,2,FALSE),\"\")","v":""},{"$nulls":6},{"$f":"IF(O94>0,VLOOKUP(O94,Set!$H$2:$J$16,2,FALSE),\"\")","v":""}]
[{"$nulls":8},{"$f":"IF(H95>0,VLOOKUP(H95,Set!$A$2:$B$4,2,FALSE),\"\")","v":""},{"$nulls":6},{"$f":"IF(O95>0,VLOOKUP(O95,Set!$H$2:$J$16,2,FALSE),\"\")","v":""}]
[{"$nulls":8},{"$f":"IF(H96>0,VLOOKUP(H96,Set!$A$2:$B$4,2,FALSE),\"\")","v":""},{"$nulls":6},{"$f":"IF(O96>0,VLOOKUP(O96,Set!$H$2:$J$16,2,FALSE),\"\")","v":""}]
[{"$nulls":8},{"$f":"IF(H97>0,VLOOKUP(H97,Set!$A$2:$B$4,2,FALSE),\"\")","v":""},{"$nulls":6},{"$f":"IF(O97>0,VLOOKUP(O97,Set!$H$2:$J$16,2,FALSE),\"\")","v":""}]
[{"$nulls":8},{"$f":"IF(H98>0,VLOOKUP(H98,Set!$A$2:$B$4,2,FALSE),\"\")","v":""},{"$nulls":6},{"$f":"IF(O98>0,VLOOKUP(O98,Set!$H$2:$J$16,2,FALSE),\"\")","v":""}]
[{"$nulls":8},{"$f":"IF(H99>0,VLOOKUP(H99,Set!$A$2:$B$4,2,FALSE),\"\")","v":""},{"$nulls":6},{"$f":"IF(O99>0,VLOOKUP(O99,Set!$H$2:$J$16,2,FALSE),\"\")","v":""}]
[{"$nulls":8},{"$f":"IF(H100>0,VLOOKUP(H100,Set!$A$2:$B$4,2,FALSE),\"\")","v":""},{"$nulls":6},{"$f":"IF(O100>0,VLOOKUP(O100,Set!$H$2:$J$16,2,FALSE),\"\")","v":""}]
[{"$nulls":8},{"$f":"IF(H101>0,VLOOKUP(H101,Set!$A$2:$B$4,2,FALSE),\"\")","v":""},{"$nulls":6},{"$f":"IF(O101>0,VLOOKUP(O101,Set!$H$2:$J$16,2,FALSE),\"\")","v":""}]
[{"$nulls":8},{"$f":"IF(H102>0,VLOOKUP(H102,Set!$A$2:$B$4,2,FALSE),\"\")","v":""},{"$nulls":6},{"$f":"IF(O102>0,VLOOKUP(O102,Set!$H$2:$J$16,2,FALSE),\"\")","v":""}]
[{"$nulls":8},{"$f":"IF(H103>0,VLOOKUP(H103,Set!$A$2:$B$4,2,FALSE),\"\")","v":""},{"$nulls":6},{"$f":"IF(O103>0,VLOOKUP(O103,Set!$H$2:$J$16,2,FALSE),\"\")","v":""}]
[{"$nulls":8},{"$f":"IF(H104>0,VLOOKUP(H104,Set!$A$2:$B$4,2,FALSE),\"\")","v":""},{"$nulls":6},{"$f":"IF(O104>0,VLOOKUP(O104,Set!$H$2:$J$16,2,FALSE),\"\")","v":""}]
[{"$nulls":8},{"$f":"IF(H105>0,VLOOKUP(H105,Set!$A$2:$B$4,2,FALSE),\"\")","v":""},{"$nulls":6},{"$f":"IF(O105>0,VLOOKUP(O105,Set!$H$2:$J$16,2,FALSE),\"\")","v":""}]
[{"$nulls":8},{"$f":"IF(H106>0,VLOOKUP(H106,Set!$A$2:$B$4,2,FALSE),\"\")","v":""},{"$nulls":6},{"$f":"IF(O106>0,VLOOKUP(O106,Set!$H$2:$J$16,2,FALSE),\"\")","v":""}]
[{"$nulls":8},{"$f":"IF(H107>0,VLOOKUP(H107,Set!$A$2:$B$4,2,FALSE),\"\")","v":""},{"$nulls":6},{"$f":"IF(O107>0,VLOOKUP(O107,Set!$H$2:$J$16,2,FALSE),\"\")","v":""}]
[{"$nulls":8},{"$f":"IF(H108>0,VLOOKUP(H108,Set!$A$2:$B$4,2,FALSE),\"\")","v":""},{"$nulls":6},{"$f":"IF(O108>0,VLOOKUP(O108,Set!$H$2:$J$16,2,FALSE),\"\")","v":""}]
[{"$nulls":8},{"$f":"IF(H109>0,VLOOKUP(H109,Set!$A$2:$B$4,2,FALSE),\"\")","v":""},{"$nulls":6},{"$f":"IF(O109>0,VLOOKUP(O109,Set!$H$2:$J$16,2,FALSE),\"\")","v":""}]
[{"$nulls":8},{"$f":"IF(H110>0,VLOOKUP(H110,Set!$A$2:$B$4,2,FALSE),\"\")","v":""},{"$nulls":6},{"$f":"IF(O110>0,VLOOKUP(O110,Set!$H$2:$J$16,2,FALSE),\"\")","v":""}]
[{"$nulls":8},{"$f":"IF(H111>0,VLOOKUP(H111,Set!$A$2:$B$4,2,FALSE),\"\")","v":""},{"$nulls":6},{"$f":"IF(O111>0,VLOOKUP(O111,Set!$H$2:$J$16,2,FALSE),\"\")","v":""}]
[{"$nulls":8},{"$f":"IF(H112>0,VLOOKUP(H112,Set!$A$2:$B$4,2,FALSE),\"\")","v":""},{"$nulls":6},{"$f":"IF(O112>0,VLOOKUP(O112,Set!$H$2:$J$16,2,FALSE),\"\")","v":""}]
[{"$nulls":8},{"$f":"IF(H113>0,VLOOKUP(H113,Set!$A$2:$B$4,2,FALSE),\"\")","v":""},{"$nulls":6},{"$f":"IF(O113>0,VLOOKUP(O113,Set!$H$2:$J$16,2,FALSE),\"\")","v":""}]
[{"$nulls":8},{"$f":"IF(H114>0,VLOOKUP(H114,Set!$A$2:$B$4,2,FALSE),\"\")","v":""},{"$nulls":6},{"$f":"IF(O114>0,VLOOKUP(O114,Set!$H$2:$J$16,2,FALSE),\"\")","v":""}]
[{"$nulls":8},{"$f":"IF(H115>0,VLOOKUP(H115,Set!$A$2:$B$4,2,FALSE),\"\")","v":""},{"$nulls":6},{"$f":"IF(O115>0,VLOOKUP(O115,Set!$H$2:$J$16,2,FALSE),\"\")","v":""}]
[{"$nulls":8},{"$f":"IF(H116>0,VLOOKUP(H116,Set!$A$2:$B$4,2,FALSE),\"\")","v":""},{"$nulls":6},{"$f":"IF(O116>0,VLOOKUP(O116,Set!$H$2:$J$16,2,FALSE),\"\")","v":""}]
[{"$nulls":8},{"$f":"IF(H117>0,VLOOKUP(H117,Set!$A$2:$B$4,2,FALSE),\"\")","v":""},{"$nulls":6},{"$f":"IF(O117>0,VLOOKUP(O117,Set!$H$2:$J$16,2,FALSE),\"\")","v":""}]
[{"$nulls":8},{"$f":"IF(H118>0,VLOOKUP(H118,Set!$A$2:$B$4,2,FALSE),\"\")","v":""},{"$nulls":6},{"$f":"IF(O118>0,VLOOKUP(O118,Set!$H$2:$J$16,2,FALSE),\"\")","v":""}]
[{"$nulls":8},{"$f":"IF(H119>0,VLOOKUP(H119,Set!$A$2:$B$4,2,FALSE),\"\")","v":""},{"$nulls":6},{"$f":"IF(O119>0,VLOOKUP(O119,Set!$H$2:$J$16,2,FALSE),\"\")","v":""}]
[{"$nulls":8},{"$f":"IF(H120>0,VLOOKUP(H120,Set!$A$2:$B$4,2,FALSE),\"\")","v":""},{"$nulls":6},{"$f":"IF(O120>0,VLOOKUP(O120,Set!$H$2:$J$16,2,FALSE),\"\")","v":""}]
{"$rows_left_out":1882}
{"sheet":"Set","index":1,"n_rows":24,"n_cols":10,"rows_kept":24,"cut":false,"hidden":true,"merged":[]}
["Rēķina veidi",null,null,"Valūta",null,"Samksas termiņs",null,"PVN kodi","Kods","Nosaukums"]
["Kredītrēķins","KR",null,"BGN",null,"00",null,"Bez PVN","B","Bez PVN "]
["Priekšapmaksas rēķins","PRR",null,"BYR",null,"01",null,"Pakalpojumi no ES","ESPA","Pakalpojumi no Eiropas Savienības"]
["Rēķins","IREK",null,"CHF",null,"02",null,"5% Preces no ES","ESPR05","Preces no Eiropas Savienības 5%"]
[null,null,null,"CNY",null,"03",null,"12% Preces no ES","ESPR12","Preces no Eiropas Savienības 12%"]
[null,null,null,"CZK",null,"04",null,"21% Preces no ES","ESPR21","Preces no Eiropas Savienības 21%"]
[null,null,null,"DKK",null,"05",null,"ES izņemts PVN reģ. nr.","EU","Eiropas savienībā izņemts PVN reģistrācijas nr."]
[null,null,null,"EUR",null,"06",null,"12 %","P12","PVN priekšnodokļa 12%"]
[null,null,null,"GBP",null,"07",null,"21 %","P21","PVN priekšnodokļa 21%"]
[null,null,null,"HRK",null,"08",null,"5 %","P5","PVN priekšnodokļa 5%"]
[null,null,null,"HUF",null,"09",null,"Vieglo TL iegāde un imports","PC","Vieglo transportlīdzekļu iegāde un imports"]
[null,null,null,"NOK",null,"10",null,"R1","R1","Reverss PVN kokmateriālu piegādei 141.p."]
[null,null,null,"PLN",null,"11",null,"R2","R2","Reverss PVN metāllūžņu piegādei 143.p."]
[null,null,null,"RUB",null,"12",null,"R3","R3","Reverss PVN būvniecības pakalpojumiem 142.p."]
[null,null,null,"SEK",null,"13",null,"R4","R4","Reverss PVN mobilo telefonu u.c. piegādei 143.1.p."]
[null,null,null,"USD",null,"14",null,"R5","R5","Reverss PVN graudaugu un tehnisko kultūru piegādei 143.2.p."]
[{"$nulls":5},"15",null,"R6","R6","Reverss PVN dārgmetālu sakausējumu piegādei 143.3.p."]
[{"$nulls":5},"16",null,"R7","R7","Reverss PVN metālizstrādājumu piegādei 143.4.p."]
[{"$nulls":5},"17",null,"R8","R8","Reverss PVN sadzīves elektronisko iekārtu piegādei 143.5.p."]
[{"$nulls":5},"18",null,"R9","R9","Reverss PVN būvizstrādājumu piegādei 142.p."]
[{"$nulls":5},"19"]
[{"$nulls":5},"20"]
[{"$nulls":5},"21"]
[{"$nulls":5},"30"]