{"text_format":"2","workbook":"xlsx","n_sheets":2,"sheets":["Sheet1","Set"],"not_rendered":{"charts":0,"images":0,"macros":0,"external_links":0,"defined_names":4,"comments":0,"pivot_tables":0},"unopened":[],"bounds":{"document_bytes":16777216,"sheet_cells":100000,"run_cost":"one","rows_first":2000,"rows_last":500,"rows_between":2000,"halvings":0,"cell_chars":16384,"cell_head_chars":4096},"cells_cut":0,"cells_raw":0,"read":"whole","date_system":"1900"}

{"sheet":"Sheet1","index":0,"n_rows":425,"n_cols":23,"rows_kept":425,"cut":false,"hidden":false,"merged":[[1,5,2,5],[1,8,2,8],[1,17,2,17]]}
[null,2,3,4,5,6,7,8,9,10,11,12,13,14,15,16,17,18,19,20,21,22,23]
[1,"Obligāts","Obligāts","Obligāts","Nemainīt","Pārbaude","Obligāts","Nemainīt","Pārbaude",{"$nulls":6},"Obligāts","Nemainīt","Pārbaude","bez mērvienības","bez mērvienības","bez mērvienības","bez mērvienības","bez mērvienības"]
[null,"Kods, bez atstarpēm","Artikula nosaukums","Artikula tips. Ievadi no izvēlnes. (noliktavas, ja vēlies uzskaitīt noliktavā)","TipsValue",null,"Mērvienība. Ievadi vērtību no izvēlnes","Mērvienības vērtība",null,"Artikula īsais kods","Komentārs. Informatīvs teksts","Artikula grupa. Ja vēlas izmantot, sākumā jāsagatavo Artikulu grupas MONEO sistēmā","Pārdošanas cena par vienību EUR","Svītru kods","Klase. Ja vēlas izmantot, sākumā jāsagatavo Artikulu klases MONEO sistēmā","Vai artikuls tiks uzskaitīts ar partijas/sērijas numuru?  Ievadi Jā/Nē","Sērijas artikuls (Value)",null,"Neto svars","Bruto svars","Platums","Gratums","Augstums"]
[1,"123ABCD","Skrūves","Noliktavas",{"$f":"IF(D4>0,VLOOKUP(D4,Set!$K$2:$L$4,2,FALSE),\"\")","v":1},null,"iepakojumi",{"$f":"IF(G4>0,VLOOKUP(G4,Set!$B$2:$C$13,2,FALSE),\"\")","v":"IEP"},{"$nulls":4},1.08,null,null,"Jā",{"$f":"IF(P4>0,VLOOKUP(P4,Set!$G$2:$H$3,2,FALSE),\"\")","v":1}]
[{"$nulls":4},{"$f":"IF(D5>0,VLOOKUP(D5,Set!$K$2:$L$4,2,FALSE),\"\")","v":""},null,null,{"$f":"IF(G5>0,VLOOKUP(G5,Set!$B$2:$C$13,2,FALSE),\"\")","v":""},{"$nulls":8},{"$f":"IF(P5>0,VLOOKUP(P5,Set!$G$2:$H$3,2,FALSE),\"\")","v":""}]
[{"$nulls":4},{"$f":"IF(D6>0,VLOOKUP(D6,Set!$K$2:$L$4,2,FALSE),\"\")","v":""},null,null,{"$f":"IF(G6>0,VLOOKUP(G6,Set!$B$2:$C$13,2,FALSE),\"\")","v":""},{"$nulls":8},{"$f":"IF(P6>0,VLOOKUP(P6,Set!$G$2:$H$3,2,FALSE),\"\")","v":""}]
[{"$nulls":4},{"$f":"IF(D7>0,VLOOKUP(D7,Set!$K$2:$L$4,2,FALSE),\"\")","v":""},null,null,{"$f":"IF(G7>0,VLOOKUP(G7,Set!$B$2:$C$13,2,FALSE),\"\")","v":""},{"$nulls":8},{"$f":"IF(P7>0,VLOOKUP(P7,Set!$G$2:$H$3,2,FALSE),\"\")","v":""}]
[{"$nulls":4},{"$f":"IF(D8>0,VLOOKUP(D8,Set!$K$2:$L$4,2,FALSE),\"\")","v":""},null,null,{"$f":"IF(G8>0,VLOOKUP(G8,Set!$B$2:$C$13,2,FALSE),\"\")","v":""},{"$nulls":8},{"$f":"IF(P8>0,VLOOKUP(P8,Set!$G$2:$H$3,2,FALSE),\"\")","v":""}]
[{"$nulls":4},{"$f":"IF(D9>0,VLOOKUP(D9,Set!$K$2:$L$4,2,FALSE),\"\")","v":""},null,null,{"$f":"IF(G9>0,VLOOKUP(G9,Set!$B$2:$C$13,2,FALSE),\"\")","v":""},{"$nulls":8},{"$f":"IF(P9>0,VLOOKUP(P9,Set!$G$2:$H$3,2,FALSE),\"\")","v":""}]
[{"$nulls":4},{"$f":"IF(D10>0,VLOOKUP(D10,Set!$K$2:$L$4,2,FALSE),\"\")","v":""},null,null,{"$f":"IF(G10>0,VLOOKUP(G10,Set!$B$2:$C$13,2,FALSE),\"\")","v":""},{"$nulls":8},{"$f":"IF(P10>0,VLOOKUP(P10,Set!$G$2:$H$3,2,FALSE),\"\")","v":""}]
[{"$nulls":4},{"$f":"IF(D11>0,VLOOKUP(D11,Set!$K$2:$L$4,2,FALSE),\"\")","v":""},null,null,{"$f":"IF(G11>0,VLOOKUP(G11,Set!$B$2:$C$13,2,FALSE),\"\")","v":""},{"$nulls":8},{"$f":"IF(P11>0,VLOOKUP(P11,Set!$G$2:$H$3,2,FALSE),\"\")","v":""}]
[{"$nulls":4},{"$f":"IF(D12>0,VLOOKUP(D12,Set!$K$2:$L$4,2,FALSE),\"\")","v":""},null,null,{"$f":"IF(G12>0,VLOOKUP(G12,Set!$B$2:$C$13,2,FALSE),\"\")","v":""},{"$nulls":8},{"$f":"IF(P12>0,VLOOKUP(P12,Set!$G$2:$H$3,2,FALSE),\"\")","v":""}]
[{"$nulls":4},{"$f":"IF(D13>0,VLOOKUP(D13,Set!$K$2:$L$4,2,FALSE),\"\")","v":""},null,null,{"$f":"IF(G13>0,VLOOKUP(G13,Set!$B$2:$C$13,2,FALSE),\"\")","v":""},{"$nulls":8},{"$f":"IF(P13>0,VLOOKUP(P13,Set!$G$2:$H$3,2,FALSE),\"\")","v":""}]
[{"$nulls":4},{"$f":"IF(D14>0,VLOOKUP(D14,Set!$K$2:$L$4,2,FALSE),\"\")","v":""},null,null,{"$f":"IF(G14>0,VLOOKUP(G14,Set!$B$2:$C$13,2,FALSE),\"\")","v":""},{"$nulls":8},{"$f":"IF(P14>0,VLOOKUP(P14,Set!$G$2:$H$3,2,FALSE),\"\")","v":""}]
[{"$nulls":4},{"$f":"IF(D15>0,VLOOKUP(D15,Set!$K$2:$L$4,2,FALSE),\"\")","v":""},null,null,{"$f":"IF(G15>0,VLOOKUP(G15,Set!$B$2:$C$13,2,FALSE),\"\")","v":""},{"$nulls":8},{"$f":"IF(P15>0,VLOOKUP(P15,Set!$G$2:$H$3,2,FALSE),\"\")","v":""}]
[{"$nulls":4},{"$f":"IF(D16>0,VLOOKUP(D16,Set!$K$2:$L$4,2,FALSE),\"\")","v":""},null,null,{"$f":"IF(G16>0,VLOOKUP(G16,Set!$B$2:$C$13,2,FALSE),\"\")","v":""},{"$nulls":8},{"$f":"IF(P16>0,VLOOKUP(P16,Set!$G$2:$H$3,2,FALSE),\"\")","v":""}]
[{"$nulls":4},{"$f":"IF(D17>0,VLOOKUP(D17,Set!$K$2:$L$4,2,FALSE),\"\")","v":""},null,null,{"$f":"IF(G17>0,VLOOKUP(G17,Set!$B$2:$C$13,2,FALSE),\"\")","v":""},{"$nulls":8},{"$f":"IF(P17>0,VLOOKUP(P17,Set!$G$2:$H$3,2,FALSE),\"\")","v":""}]
[{"$nulls":4},{"$f":"IF(D18>0,VLOOKUP(D18,Set!$K$2:$L$4,2,FALSE),\"\")","v":""},null,null,{"$f":"IF(G18>0,VLOOKUP(G18,Set!$B$2:$C$13,2,FALSE),\"\")","v":""},{"$nulls":8},{"$f":"IF(P18>0,VLOOKUP(P18,Set!$G$2:$H$3,2,FALSE),\"\")","v":""}]
[{"$nulls":4},{"$f":"IF(D19>0,VLOOKUP(D19,Set!$K$2:$L$4,2,FALSE),\"\")","v":""},null,null,{"$f":"IF(G19>0,VLOOKUP(G19,Set!$B$2:$C$13,2,FALSE),\"\")","v":""},{"$nulls":8},{"$f":"IF(P19>0,VLOOKUP(P19,Set!$G$2:$H$3,2,FALSE),\"\")","v":""}]
[{"$nulls":4},{"$f":"IF(D20>0,VLOOKUP(D20,Set!$K$2:$L$4,2,FALSE),\"\")","v":""},null,null,{"$f":"IF(G20>0,VLOOKUP(G20,Set!$B$2:$C$13,2,FALSE),\"\")","v":""},{"$nulls":8},{"$f":"IF(P20>0,VLOOKUP(P20,Set!$G$2:$H$3,2,FALSE),\"\")","v":""}]
[{"$nulls":4},{"$f":"IF(D21>0,VLOOKUP(D21,Set!$K$2:$L$4,2,FALSE),\"\")","v":""},null,null,{"$f":"IF(G21>0,VLOOKUP(G21,Set!$B$2:$C$13,2,FALSE),\"\")","v":""},{"$nulls":8},{"$f":"IF(P21>0,VLOOKUP(P21,Set!$G$2:$H$3,2,FALSE),\"\")","v":""}]
[{"$nulls":4},{"$f":"IF(D22>0,VLOOKUP(D22,Set!$K$2:$L$4,2,FALSE),\"\")","v":""},null,null,{"$f":"IF(G22>0,VLOOKUP(G22,Set!$B$2:$C$13,2,FALSE),\"\")","v":""},{"$nulls":8},{"$f":"IF(P22>0,VLOOKUP(P22,Set!$G$2:$H$3,2,FALSE),\"\")","v":""}]
[{"$nulls":4},{"$f":"IF(D23>0,VLOOKUP(D23,Set!$K$2:$L$4,2,FALSE),\"\")","v":""},null,null,{"$f":"IF(G23>0,VLOOKUP(G23,Set!$B$2:$C$13,2,FALSE),\"\")","v":""},{"$nulls":8},{"$f":"IF(P23>0,VLOOKUP(P23,Set!$G$2:$H$3,2,FALSE),\"\")","v":""}]
[{"$nulls":4},{"$f":"IF(D24>0,VLOOKUP(D24,Set!$K$2:$L$4,2,FALSE),\"\")","v":""},null,null,{"$f":"IF(G24>0,VLOOKUP(G24,Set!$B$2:$C$13,2,FALSE),\"\")","v":""},{"$nulls":8},{"$f":"IF(P24>0,VLOOKUP(P24,Set!$G$2:$H$3,2,FALSE),\"\")","v":""}]
[{"$nulls":4},{"$f":"IF(D25>0,VLOOKUP(D25,Set!$K$2:$L$4,2,FALSE),\"\")","v":""},null,null,{"$f":"IF(G25>0,VLOOKUP(G25,Set!$B$2:$C$13,2,FALSE),\"\")","v":""},{"$nulls":8},{"$f":"IF(P25>0,VLOOKUP(P25,Set!$G$2:$H$3,2,FALSE),\"\")","v":""}]
[{"$nulls":4},{"$f":"IF(D26>0,VLOOKUP(D26,Set!$K$2:$L$4,2,FALSE),\"\")","v":""},null,null,{"$f":"IF(G26>0,VLOOKUP(G26,Set!$B$2:$C$13,2,FALSE),\"\")","v":""},{"$nulls":8},{"$f":"IF(P26>0,VLOOKUP(P26,Set!$G$2:$H$3,2,FALSE),\"\")","v":""}]
[{"$nulls":4},{"$f":"IF(D27>0,VLOOKUP(D27,Set!$K$2:$L$4,2,FALSE),\"\")","v":""},null,null,{"$f":"IF(G27>0,VLOOKUP(G27,Set!$B$2:$C$13,2,FALSE),\"\")","v":""},{"$nulls":8},{"$f":"IF(P27>0,VLOOKUP(P27,Set!$G$2:$H$3,2,FALSE),\"\")","v":""}]
[{"$nulls":4},{"$f":"IF(D28>0,VLOOKUP(D28,Set!$K$2:$L$4,2,FALSE),\"\")","v":""},null,null,{"$f":"IF(G28>0,VLOOKUP(G28,Set!$B$2:$C$13,2,FALSE),\"\")","v":""},{"$nulls":8},{"$f":"IF(P28>0,VLOOKUP(P28,Set!$G$2:$H$3,2,FALSE),\"\")","v":""}]
[{"$nulls":4},{"$f":"IF(D29>0,VLOOKUP(D29,Set!$K$2:$L$4,2,FALSE),\"\")","v":""},null,null,{"$f":"IF(G29>0,VLOOKUP(G29,Set!$B$2:$C$13,2,FALSE),\"\")","v":""},{"$nulls":8},{"$f":"IF(P29>0,VLOOKUP(P29,Set!$G$2:$H$3,2,FALSE),\"\")","v":""}]
[{"$nulls":4},{"$f":"IF(D30>0,VLOOKUP(D30,Set!$K$2:$L$4,2,FALSE),\"\")","v":""},null,null,{"$f":"IF(G30>0,VLOOKUP(G30,Set!$B$2:$C$13,2,FALSE),\"\")","v":""},{"$nulls":8},{"$f":"IF(P30>0,VLOOKUP(P30,Set!$G$2:$H$3,2,FALSE),\"\")","v":""}]
[{"$nulls":4},{"$f":"IF(D31>0,VLOOKUP(D31,Set!$K$2:$L$4,2,FALSE),\"\")","v":""},null,null,{"$f":"IF(G31>0,VLOOKUP(G31,Set!$B$2:$C$13,2,FALSE),\"\")","v":""},{"$nulls":8},{"$f":"IF(P31>0,VLOOKUP(P31,Set!$G$2:$H$3,2,FALSE),\"\")","v":""}]
[{"$nulls":4},{"$f":"IF(D32>0,VLOOKUP(D32,Set!$K$2:$L$4,2,FALSE),\"\")","v":""},null,null,{"$f":"IF(G32>0,VLOOKUP(G32,Set!$B$2:$C$13,2,FALSE),\"\")","v":""},{"$nulls":8},{"$f":"IF(P32>0,VLOOKUP(P32,Set!$G$2:$H$3,2,FALSE),\"\")","v":""}]
[{"$nulls":4},{"$f":"IF(D33>0,VLOOKUP(D33,Set!$K$2:$L$4,2,FALSE),\"\")","v":""},null,null,{"$f":"IF(G33>0,VLOOKUP(G33,Set!$B$2:$C$13,2,FALSE),\"\")","v":""},{"$nulls":8},{"$f":"IF(P33>0,VLOOKUP(P33,Set!$G$2:$H$3,2,FALSE),\"\")","v":""}]
[{"$nulls":4},{"$f":"IF(D34>0,VLOOKUP(D34,Set!$K$2:$L$4,2,FALSE),\"\")","v":""},null,null,{"$f":"IF(G34>0,VLOOKUP(G34,Set!$B$2:$C$13,2,FALSE),\"\")","v":""},{"$nulls":8},{"$f":"IF(P34>0,VLOOKUP(P34,Set!$G$2:$H$3,2,FALSE),\"\")","v":""}]
[{"$nulls":4},{"$f":"IF(D35>0,VLOOKUP(D35,Set!$K$2:$L$4,2,FALSE),\"\")","v":""},null,null,{"$f":"IF(G35>0,VLOOKUP(G35,Set!$B$2:$C$13,2,FALSE),\"\")","v":""},{"$nulls":8},{"$f":"IF(P35>0,VLOOKUP(P35,Set!$G$2:$H$3,2,FALSE),\"\")","v":""}]
[{"$nulls":4},{"$f":"IF(D36>0,VLOOKUP(D36,Set!$K$2:$L$4,2,FALSE),\"\")","v":""},null,null,{"$f":"IF(G36>0,VLOOKUP(G36,Set!$B$2:$C$13,2,FALSE),\"\")","v":""},{"$nulls":8},{"$f":"IF(P36>0,VLOOKUP(P36,Set!$G$2:$H$3,2,FALSE),\"\")","v":""}]
[{"$nulls":4},{"$f":"IF(D37>0,VLOOKUP(D37,Set!$K$2:$L$4,2,FALSE),\"\")","v":""},null,null,{"$f":"IF(G37>0,VLOOKUP(G37,Set!$B$2:$C$13,2,FALSE),\"\")","v":""},{"$nulls":8},{"$f":"IF(P37>0,VLOOKUP(P37,Set!$G$2:$H$3,2,FALSE),\"\")","v":""}]
[{"$nulls":4},{"$f":"IF(D38>0,VLOOKUP(D38,Set!$K$2:$L$4,2,FALSE),\"\")","v":""},null,null,{"$f":"IF(G38>0,VLOOKUP(G38,Set!$B$2:$C$13,2,FALSE),\"\")","v":""},{"$nulls":8},{"$f":"IF(P38>0,VLOOKUP(P38,Set!$G$2:$H$3,2,FALSE),\"\")","v":""}]
[{"$nulls":4},{"$f":"IF(D39>0,VLOOKUP(D39,Set!$K$2:$L$4,2,FALSE),\"\")","v":""},null,null,{"$f":"IF(G39>0,VLOOKUP(G39,Set!$B$2:$C$13,2,FALSE),\"\")","v":""},{"$nulls":8},{"$f":"IF(P39>0,VLOOKUP(P39,Set!$G$2:$H$3,2,FALSE),\"\")","v":""}]
[{"$nulls":4},{"$f":"IF(D40>0,VLOOKUP(D40,Set!$K$2:$L$4,2,FALSE),\"\")","v":""},null,null,{"$f":"IF(G40>0,VLOOKUP(G40,Set!$B$2:$C$13,2,FALSE),\"\")","v":""},{"$nulls":8},{"$f":"IF(P40>0,VLOOKUP(P40,Set!$G$2:$H$3,2,FALSE),\"\")","v":""}]
[{"$nulls":4},{"$f":"IF(D41>0,VLOOKUP(D41,Set!$K$2:$L$4,2,FALSE),\"\")","v":""},null,null,{"$f":"IF(G41>0,VLOOKUP(G41,Set!$B$2:$C$13,2,FALSE),\"\")","v":""},{"$nulls":8},{"$f":"IF(P41>0,VLOOKUP(P41,Set!$G$2:$H$3,2,FALSE),\"\")","v":""}]
[{"$nulls":4},{"$f":"IF(D42>0,VLOOKUP(D42,Set!$K$2:$L$4,2,FALSE),\"\")","v":""},null,null,{"$f":"IF(G42>0,VLOOKUP(G42,Set!$B$2:$C$13,2,FALSE),\"\")","v":""},{"$nulls":8},{"$f":"IF(P42>0,VLOOKUP(P42,Set!$G$2:$H$3,2,FALSE),\"\")","v":""}]
[{"$nulls":4},{"$f":"IF(D43>0,VLOOKUP(D43,Set!$K$2:$L$4,2,FALSE),\"\")","v":""},null,null,{"$f":"IF(G43>0,VLOOKUP(G43,Set!$B$2:$C$13,2,FALSE),\"\")","v":""},{"$nulls":8},{"$f":"IF(P43>0,VLOOKUP(P43,Set!$G$2:$H$3,2,FALSE),\"\")","v":""}]
[{"$nulls":4},{"$f":"IF(D44>0,VLOOKUP(D44,Set!$K$2:$L$4,2,FALSE),\"\")","v":""},null,null,{"$f":"IF(G44>0,VLOOKUP(G44,Set!$B$2:$C$13,2,FALSE),\"\")","v":""},{"$nulls":8},{"$f":"IF(P44>0,VLOOKUP(P44,Set!$G$2:$H$3,2,FALSE),\"\")","v":""}]
[{"$nulls":4},{"$f":"IF(D45>0,VLOOKUP(D45,Set!$K$2:$L$4,2,FALSE),\"\")","v":""},null,null,{"$f":"IF(G45>0,VLOOKUP(G45,Set!$B$2:$C$13,2,FALSE),\"\")","v":""},{"$nulls":8},{"$f":"IF(P45>0,VLOOKUP(P45,Set!$G$2:$H$3,2,FALSE),\"\")","v":""}]
[{"$nulls":4},{"$f":"IF(D46>0,VLOOKUP(D46,Set!$K$2:$L$4,2,FALSE),\"\")","v":""},null,null,{"$f":"IF(G46>0,VLOOKUP(G46,Set!$B$2:$C$13,2,FALSE),\"\")","v":""},{"$nulls":8},{"$f":"IF(P46>0,VLOOKUP(P46,Set!$G$2:$H$3,2,FALSE),\"\")","v":""}]
[{"$nulls":4},{"$f":"IF(D47>0,VLOOKUP(D47,Set!$K$2:$L$4,2,FALSE),\"\")","v":""},null,null,{"$f":"IF(G47>0,VLOOKUP(G47,Set!$B$2:$C$13,2,FALSE),\"\")","v":""},{"$nulls":8},{"$f":"IF(P47>0,VLOOKUP(P47,Set!$G$2:$H$3,2,FALSE),\"\")","v":""}]
[{"$nulls":4},{"$f":"IF(D48>0,VLOOKUP(D48,Set!$K$2:$L$4,2,FALSE),\"\")","v":""},null,null,{"$f":"IF(G48>0,VLOOKUP(G48,Set!$B$2:$C$13,2,FALSE),\"\")","v":""},{"$nulls":8},{"$f":"IF(P48>0,VLOOKUP(P48,Set!$G$2:$H$3,2,FALSE),\"\")","v":""}]
[{"$nulls":4},{"$f":"IF(D49>0,VLOOKUP(D49,Set!$K$2:$L$4,2,FALSE),\"\")","v":""},null,null,{"$f":"IF(G49>0,VLOOKUP(G49,Set!$B$2:$C$13,2,FALSE),\"\")","v":""},{"$nulls":8},{"$f":"IF(P49>0,VLOOKUP(P49,Set!$G$2:$H$3,2,FALSE),\"\")","v":""}]
[{"$nulls":4},{"$f":"IF(D50>0,VLOOKUP(D50,Set!$K$2:$L$4,2,FALSE),\"\")","v":""},null,null,{"$f":"IF(G50>0,VLOOKUP(G50,Set!$B$2:$C$13,2,FALSE),\"\")","v":""},{"$nulls":8},{"$f":"IF(P50>0,VLOOKUP(P50,Set!$G$2:$H$3,2,FALSE),\"\")","v":""}]
[{"$nulls":4},{"$f":"IF(D51>0,VLOOKUP(D51,Set!$K$2:$L$4,2,FALSE),\"\")","v":""},null,null,{"$f":"IF(G51>0,VLOOKUP(G51,Set!$B$2:$C$13,2,FALSE),\"\")","v":""},{"$nulls":8},{"$f":"IF(P51>0,VLOOKUP(P51,Set!$G$2:$H$3,2,FALSE),\"\")","v":""}]
[{"$nulls":4},{"$f":"IF(D52>0,VLOOKUP(D52,Set!$K$2:$L$4,2,FALSE),\"\")","v":""},null,null,{"$f":"IF(G52>0,VLOOKUP(G52,Set!$B$2:$C$13,2,FALSE),\"\")","v":""},{"$nulls":8},{"$f":"IF(P52>0,VLOOKUP(P52,Set!$G$2:$H$3,2,FALSE),\"\")","v":""}]
[{"$nulls":4},{"$f":"IF(D53>0,VLOOKUP(D53,Set!$K$2:$L$4,2,FALSE),\"\")","v":""},null,null,{"$f":"IF(G53>0,VLOOKUP(G53,Set!$B$2:$C$13,2,FALSE),\"\")","v":""},{"$nulls":8},{"$f":"IF(P53>0,VLOOKUP(P53,Set!$G$2:$H$3,2,FALSE),\"\")","v":""}]
[{"$nulls":4},{"$f":"IF(D54>0,VLOOKUP(D54,Set!$K$2:$L$4,2,FALSE),\"\")","v":""},null,null,{"$f":"IF(G54>0,VLOOKUP(G54,Set!$B$2:$C$13,2,FALSE),\"\")","v":""},{"$nulls":8},{"$f":"IF(P54>0,VLOOKUP(P54,Set!$G$2:$H$3,2,FALSE),\"\")","v":""}]
[{"$nulls":4},{"$f":"IF(D55>0,VLOOKUP(D55,Set!$K$2:$L$4,2,FALSE),\"\")","v":""},null,null,{"$f":"IF(G55>0,VLOOKUP(G55,Set!$B$2:$C$13,2,FALSE),\"\")","v":""},{"$nulls":8},{"$f":"IF(P55>0,VLOOKUP(P55,Set!$G$2:$H$3,2,FALSE),\"\")","v":""}]
[{"$nulls":4},{"$f":"IF(D56>0,VLOOKUP(D56,Set!$K$2:$L$4,2,FALSE),\"\")","v":""},null,null,{"$f":"IF(G56>0,VLOOKUP(G56,Set!$B$2:$C$13,2,FALSE),\"\")","v":""},{"$nulls":8},{"$f":"IF(P56>0,VLOOKUP(P56,Set!$G$2:$H$3,2,FALSE),\"\")","v":""}]
[{"$nulls":4},{"$f":"IF(D57>0,VLOOKUP(D57,Set!$K$2:$L$4,2,FALSE),\"\")","v":""},null,null,{"$f":"IF(G57>0,VLOOKUP(G57,Set!$B$2:$C$13,2,FALSE),\"\")","v":""},{"$nulls":8},{"$f":"IF(P57>0,VLOOKUP(P57,Set!$G$2:$H$3,2,FALSE),\"\")","v":""}]
[{"$nulls":4},{"$f":"IF(D58>0,VLOOKUP(D58,Set!$K$2:$L$4,2,FALSE),\"\")","v":""},null,null,{"$f":"IF(G58>0,VLOOKUP(G58,Set!$B$2:$C$13,2,FALSE),\"\")","v":""},{"$nulls":8},{"$f":"IF(P58>0,VLOOKUP(P58,Set!$G$2:$H$3,2,FALSE),\"\")","v":""}]
[{"$nulls":4},{"$f":"IF(D59>0,VLOOKUP(D59,Set!$K$2:$L$4,2,FALSE),\"\")","v":""},null,null,{"$f":"IF(G59>0,VLOOKUP(G59,Set!$B$2:$C$13,2,FALSE),\"\")","v":""},{"$nulls":8},{"$f":"IF(P59>0,VLOOKUP(P59,Set!$G$2:$H$3,2,FALSE),\"\")","v":""}]
[{"$nulls":4},{"$f":"IF(D60>0,VLOOKUP(D60,Set!$K$2:$L$4,2,FALSE),\"\")","v":""},null,null,{"$f":"IF(G60>0,VLOOKUP(G60,Set!$B$2:$C$13,2,FALSE),\"\")","v":""},{"$nulls":8},{"$f":"IF(P60>0,VLOOKUP(P60,Set!$G$2:$H$3,2,FALSE),\"\")","v":""}]
[{"$nulls":4},{"$f":"IF(D61>0,VLOOKUP(D61,Set!$K$2:$L$4,2,FALSE),\"\")","v":""},null,null,{"$f":"IF(G61>0,VLOOKUP(G61,Set!$B$2:$C$13,2,FALSE),\"\")","v":""},{"$nulls":8},{"$f":"IF(P61>0,VLOOKUP(P61,Set!$G$2:$H$3,2,FALSE),\"\")","v":""}]
[{"$nulls":4},{"$f":"IF(D62>0,VLOOKUP(D62,Set!$K$2:$L$4,2,FALSE),\"\")","v":""},null,null,{"$f":"IF(G62>0,VLOOKUP(G62,Set!$B$2:$C$13,2,FALSE),\"\")","v":""},{"$nulls":8},{"$f":"IF(P62>0,VLOOKUP(P62,Set!$G$2:$H$3,2,FALSE),\"\")","v":""}]
[{"$nulls":4},{"$f":"IF(D63>0,VLOOKUP(D63,Set!$K$2:$L$4,2,FALSE),\"\")","v":""},null,null,{"$f":"IF(G63>0,VLOOKUP(G63,Set!$B$2:$C$13,2,FALSE),\"\")","v":""},{"$nulls":8},{"$f":"IF(P63>0,VLOOKUP(P63,Set!$G$2:$H$3,2,FALSE),\"\")","v":""}]
[{"$nulls":4},{"$f":"IF(D64>0,VLOOKUP(D64,Set!$K$2:$L$4,2,FALSE),\"\")","v":""},null,null,{"$f":"IF(G64>0,VLOOKUP(G64,Set!$B$2:$C$13,2,FALSE),\"\")","v":""},{"$nulls":8},{"$f":"IF(P64>0,VLOOKUP(P64,Set!$G$2:$H$3,2,FALSE),\"\")","v":""}]
[{"$nulls":4},{"$f":"IF(D65>0,VLOOKUP(D65,Set!$K$2:$L$4,2,FALSE),\"\")","v":""},null,null,{"$f":"IF(G65>0,VLOOKUP(G65,Set!$B$2:$C$13,2,FALSE),\"\")","v":""},{"$nulls":8},{"$f":"IF(P65>0,VLOOKUP(P65,Set!$G$2:$H$3,2,FALSE),\"\")","v":""}]
[{"$nulls":4},{"$f":"IF(D66>0,VLOOKUP(D66,Set!$K$2:$L$4,2,FALSE),\"\")","v":""},null,null,{"$f":"IF(G66>0,VLOOKUP(G66,Set!$B$2:$C$13,2,FALSE),\"\")","v":""},{"$nulls":8},{"$f":"IF(P66>0,VLOOKUP(P66,Set!$G$2:$H$3,2,FALSE),\"\")","v":""}]
[{"$nulls":4},{"$f":"IF(D67>0,VLOOKUP(D67,Set!$K$2:$L$4,2,FALSE),\"\")","v":""},null,null,{"$f":"IF(G67>0,VLOOKUP(G67,Set!$B$2:$C$13,2,FALSE),\"\")","v":""},{"$nulls":8},{"$f":"IF(P67>0,VLOOKUP(P67,Set!$G$2:$H$3,2,FALSE),\"\")","v":""}]
[{"$nulls":4},{"$f":"IF(D68>0,VLOOKUP(D68,Set!$K$2:$L$4,2,FALSE),\"\")","v":""},null,null,{"$f":"IF(G68>0,VLOOKUP(G68,Set!$B$2:$C$13,2,FALSE),\"\")","v":""},{"$nulls":8},{"$f":"IF(P68>0,VLOOKUP(P68,Set!$G$2:$H$3,2,FALSE),\"\")","v":""}]
[{"$nulls":4},{"$f":"IF(D69>0,VLOOKUP(D69,Set!$K$2:$L$4,2,FALSE),\"\")","v":""},null,null,{"$f":"IF(G69>0,VLOOKUP(G69,Set!$B$2:$C$13,2,FALSE),\"\")","v":""},{"$nulls":8},{"$f":"IF(P69>0,VLOOKUP(P69,Set!$G$2:$H$3,2,FALSE),\"\")","v":""}]
[{"$nulls":4},{"$f":"IF(D70>0,VLOOKUP(D70,Set!$K$2:$L$4,2,FALSE),\"\")","v":""},null,null,{"$f":"IF(G70>0,VLOOKUP(G70,Set!$B$2:$C$13,2,FALSE),\"\")","v":""},{"$nulls":8},{"$f":"IF(P70>0,VLOOKUP(P70,Set!$G$2:$H$3,2,FALSE),\"\")","v":""}]
[{"$nulls":4},{"$f":"IF(D71>0,VLOOKUP(D71,Set!$K$2:$L$4,2,FALSE),\"\")","v":""},null,null,{"$f":"IF(G71>0,VLOOKUP(G71,Set!$B$2:$C$13,2,FALSE),\"\")","v":""},{"$nulls":8},{"$f":"IF(P71>0,VLOOKUP(P71,Set!$G$2:$H$3,2,FALSE),\"\")","v":""}]
[{"$nulls":4},{"$f":"IF(D72>0,VLOOKUP(D72,Set!$K$2:$L$4,2,FALSE),\"\")","v":""},null,null,{"$f":"IF(G72>0,VLOOKUP(G72,Set!$B$2:$C$13,2,FALSE),\"\")","v":""},{"$nulls":8},{"$f":"IF(P72>0,VLOOKUP(P72,Set!$G$2:$H$3,2,FALSE),\"\")","v":""}]
[{"$nulls":4},{"$f":"IF(D73>0,VLOOKUP(D73,Set!$K$2:$L$4,2,FALSE),\"\")","v":""},null,null,{"$f":"IF(G73>0,VLOOKUP(G73,Set!$B$2:$C$13,2,FALSE),\"\")","v":""},{"$nulls":8},{"$f":"IF(P73>0,VLOOKUP(P73,Set!$G$2:$H$3,2,FALSE),\"\")","v":""}]
[{"$nulls":4},{"$f":"IF(D74>0,VLOOKUP(D74,Set!$K$2:$L$4,2,FALSE),\"\")","v":""},null,null,{"$f":"IF(G74>0,VLOOKUP(G74,Set!$B$2:$C$13,2,FALSE),\"\")","v":""},{"$nulls":8},{"$f":"IF(P74>0,VLOOKUP(P74,Set!$G$2:$H$3,2,FALSE),\"\")","v":""}]
[{"$nulls":4},{"$f":"IF(D75>0,VLOOKUP(D75,Set!$K$2:$L$4,2,FALSE),\"\")","v":""},null,null,{"$f":"IF(G75>0,VLOOKUP(G75,Set!$B$2:$C$13,2,FALSE),\"\")","v":""},{"$nulls":8},{"$f":"IF(P75>0,VLOOKUP(P75,Set!$G$2:$H$3,2,FALSE),\"\")","v":""}]
[{"$nulls":4},{"$f":"IF(D76>0,VLOOKUP(D76,Set!$K$2:$L$4,2,FALSE),\"\")","v":""},null,null,{"$f":"IF(G76>0,VLOOKUP(G76,Set!$B$2:$C$13,2,FALSE),\"\")","v":""},{"$nulls":8},{"$f":"IF(P76>0,VLOOKUP(P76,Set!$G$2:$H$3,2,FALSE),\"\")","v":""}]
[{"$nulls":4},{"$f":"IF(D77>0,VLOOKUP(D77,Set!$K$2:$L$4,2,FALSE),\"\")","v":""},null,null,{"$f":"IF(G77>0,VLOOKUP(G77,Set!$B$2:$C$13,2,FALSE),\"\")","v":""},{"$nulls":8},{"$f":"IF(P77>0,VLOOKUP(P77,Set!$G$2:$H$3,2,FALSE),\"\")","v":""}]
[{"$nulls":4},{"$f":"IF(D78>0,VLOOKUP(D78,Set!$K$2:$L$4,2,FALSE),\"\")","v":""},null,null,{"$f":"IF(G78>0,VLOOKUP(G78,Set!$B$2:$C$13,2,FALSE),\"\")","v":""},{"$nulls":8},{"$f":"IF(P78>0,VLOOKUP(P78,Set!$G$2:$H$3,2,FALSE),\"\")","v":""}]
[{"$nulls":4},{"$f":"IF(D79>0,VLOOKUP(D79,Set!$K$2:$L$4,2,FALSE),\"\")","v":""},null,null,{"$f":"IF(G79>0,VLOOKUP(G79,Set!$B$2:$C$13,2,FALSE),\"\")","v":""},{"$nulls":8},{"$f":"IF(P79>0,VLOOKUP(P79,Set!$G$2:$H$3,2,FALSE),\"\")","v":""}]
[{"$nulls":4},{"$f":"IF(D80>0,VLOOKUP(D80,Set!$K$2:$L$4,2,FALSE),\"\")","v":""},null,null,{"$f":"IF(G80>0,VLOOKUP(G80,Set!$B$2:$C$13,2,FALSE),\"\")","v":""},{"$nulls":8},{"$f":"IF(P80>0,VLOOKUP(P80,Set!$G$2:$H$3,2,FALSE),\"\")","v":""}]
{"$rows_left_out":346}
{"sheet":"Set","index":1,"n_rows":15,"n_cols":12,"rows_kept":15,"cut":false,"hidden":true,"merged":[]}
[null,"Mērvienības",{"$nulls":4},"Jā / Nē vērtības",null,null,null,"Tips"]
[null,"gabali","GAB",null,null,null,"Nē",0,null,null,"Parasts",0]
[null,"grami","G",null,null,null,"Jā",1,null,null,"Noliktavas",1]
[null,"iepakojumi","IEP",{"$nulls":7},"Strukturēts",2]
[null,"kilogrami","KG"]
[null,"kilometri","KM"]
[null,"kubikmetri","M3"]
[null,"kvadrātmetri","M2"]
[null,"litri","L"]
[null,"metri","M"]
[null,"mililitri","ML"]
[null,"minūte","MIN"]
[null,"paka","PK"]
[null,"palete","PAL"]
[null,"stunda","H"]