{"text_format":"2","workbook":"xlsx","n_sheets":2,"sheets":["Sheet1","Set"],"not_rendered":{"charts":0,"images":0,"macros":0,"external_links":0,"defined_names":0,"comments":0,"pivot_tables":0},"unopened":[],"bounds":{"document_bytes":16777216,"sheet_cells":100000,"run_cost":"one","rows_first":2000,"rows_last":500,"rows_between":2000,"halvings":0,"cell_chars":16384,"cell_head_chars":4096},"cells_cut":0,"cells_raw":0,"read":"whole","date_system":"1900"}

{"sheet":"Sheet1","index":0,"n_rows":1039,"n_cols":26,"rows_kept":1039,"cut":false,"hidden":false,"merged":[[1,2,2,2],[1,4,2,4],[1,10,2,10],[1,14,2,14],[1,17,2,17],[1,22,2,22],[1,23,2,23],[1,24,2,24],[1,25,2,25]]}
[1,2,3,4,5,6,7,8,9,10,11,12,13,14,15,16,17,18,19,20,21,22,23,24,25,26]
[1,"Obligāts","Pārbaude","Obligāts","Pārbaude","Obligāts","Obligāts",null,"Obligāts","Nemainīt","Pārbaude",null,"Obligāts","Obligāts","Pārbaude","Vēlams",null,"Pārbaude","Nemainīt",null,null,null,"Klienta sam. termiņš (dienas) Izvēlies no saraksta","Pārbaude","Pieg. sam. term. (dienas) Izvēlies no saraksta","Pārbaude"]
[1,"Klients? Jā/Nē",null,"Piegādātājs? Jā/Nē",null,"Uzņēmuma nosaukums","Juridiskā adrese","Piegādes adrese","Valsts. Izvēlies no saraksta","Valsts ID",null,"PVN reģistrācijas nr.","Reģistrācijas nr.","PVN maksātājs? Jā/Nē",null,"Bankas konts","Banka. Izvēlies no saraksta",null,"Bankas ID","E-pasts","Tālrunis","Mobilais"]
[null,"Nē",null,"Jā",null,"Moneo Latvia, SIA","Eduarda Smiļģa iela 2a, Rīga",null,"Latvija",{"$f":"IF(I4>0,VLOOKUP(I4,Set!$A$2:$B$250,2,FALSE),\"\")","v":"LV"},null,"LV400012312312","400012312312","Jā",null,"LV68HABA0551040256994","Swedbanka AS",null,{"$f":"IF(Q4>0,VLOOKUP(Q4,Set!$D$2:$E$23,2,FALSE),\"\")","v":"HABALV"},"info@moneo.lv",62901155,null,"05",null,"05"]
[{"$nulls":9},{"$f":"IF(I5>0,VLOOKUP(I5,Set!$A$2:$B$250,2,FALSE),\"\")","v":""},{"$nulls":8},{"$f":"IF(Q5>0,VLOOKUP(Q5,Set!$D$2:$E$23,2,FALSE),\"\")","v":""}]
[{"$nulls":9},{"$f":"IF(I6>0,VLOOKUP(I6,Set!$A$2:$B$250,2,FALSE),\"\")","v":""},{"$nulls":8},{"$f":"IF(Q6>0,VLOOKUP(Q6,Set!$D$2:$E$23,2,FALSE),\"\")","v":""}]
[{"$nulls":9},{"$f":"IF(I7>0,VLOOKUP(I7,Set!$A$2:$B$250,2,FALSE),\"\")","v":""},{"$nulls":8},{"$f":"IF(Q7>0,VLOOKUP(Q7,Set!$D$2:$E$23,2,FALSE),\"\")","v":""}]
[{"$nulls":9},{"$f":"IF(I8>0,VLOOKUP(I8,Set!$A$2:$B$250,2,FALSE),\"\")","v":""},{"$nulls":8},{"$f":"IF(Q8>0,VLOOKUP(Q8,Set!$D$2:$E$23,2,FALSE),\"\")","v":""}]
[{"$nulls":9},{"$f":"IF(I9>0,VLOOKUP(I9,Set!$A$2:$B$250,2,FALSE),\"\")","v":""},{"$nulls":8},{"$f":"IF(Q9>0,VLOOKUP(Q9,Set!$D$2:$E$23,2,FALSE),\"\")","v":""}]
[{"$nulls":9},{"$f":"IF(I10>0,VLOOKUP(I10,Set!$A$2:$B$250,2,FALSE),\"\")","v":""},{"$nulls":8},{"$f":"IF(Q10>0,VLOOKUP(Q10,Set!$D$2:$E$23,2,FALSE),\"\")","v":""}]
[{"$nulls":9},{"$f":"IF(I11>0,VLOOKUP(I11,Set!$A$2:$B$250,2,FALSE),\"\")","v":""},{"$nulls":8},{"$f":"IF(Q11>0,VLOOKUP(Q11,Set!$D$2:$E$23,2,FALSE),\"\")","v":""}]
[{"$nulls":9},{"$f":"IF(I12>0,VLOOKUP(I12,Set!$A$2:$B$250,2,FALSE),\"\")","v":""},{"$nulls":8},{"$f":"IF(Q12>0,VLOOKUP(Q12,Set!$D$2:$E$23,2,FALSE),\"\")","v":""}]
[{"$nulls":9},{"$f":"IF(I13>0,VLOOKUP(I13,Set!$A$2:$B$250,2,FALSE),\"\")","v":""},{"$nulls":8},{"$f":"IF(Q13>0,VLOOKUP(Q13,Set!$D$2:$E$23,2,FALSE),\"\")","v":""}]
[{"$nulls":9},{"$f":"IF(I14>0,VLOOKUP(I14,Set!$A$2:$B$250,2,FALSE),\"\")","v":""},{"$nulls":8},{"$f":"IF(Q14>0,VLOOKUP(Q14,Set!$D$2:$E$23,2,FALSE),\"\")","v":""}]
[{"$nulls":9},{"$f":"IF(I15>0,VLOOKUP(I15,Set!$A$2:$B$250,2,FALSE),\"\")","v":""},{"$nulls":8},{"$f":"IF(Q15>0,VLOOKUP(Q15,Set!$D$2:$E$23,2,FALSE),\"\")","v":""}]
[{"$nulls":9},{"$f":"IF(I16>0,VLOOKUP(I16,Set!$A$2:$B$250,2,FALSE),\"\")","v":""},{"$nulls":8},{"$f":"IF(Q16>0,VLOOKUP(Q16,Set!$D$2:$E$23,2,FALSE),\"\")","v":""}]
[{"$nulls":9},{"$f":"IF(I17>0,VLOOKUP(I17,Set!$A$2:$B$250,2,FALSE),\"\")","v":""},{"$nulls":8},{"$f":"IF(Q17>0,VLOOKUP(Q17,Set!$D$2:$E$23,2,FALSE),\"\")","v":""}]
[{"$nulls":9},{"$f":"IF(I18>0,VLOOKUP(I18,Set!$A$2:$B$250,2,FALSE),\"\")","v":""},{"$nulls":8},{"$f":"IF(Q18>0,VLOOKUP(Q18,Set!$D$2:$E$23,2,FALSE),\"\")","v":""}]
[{"$nulls":9},{"$f":"IF(I19>0,VLOOKUP(I19,Set!$A$2:$B$250,2,FALSE),\"\")","v":""},{"$nulls":8},{"$f":"IF(Q19>0,VLOOKUP(Q19,Set!$D$2:$E$23,2,FALSE),\"\")","v":""}]
[{"$nulls":9},{"$f":"IF(I20>0,VLOOKUP(I20,Set!$A$2:$B$250,2,FALSE),\"\")","v":""},{"$nulls":8},{"$f":"IF(Q20>0,VLOOKUP(Q20,Set!$D$2:$E$23,2,FALSE),\"\")","v":""}]
[{"$nulls":9},{"$f":"IF(I21>0,VLOOKUP(I21,Set!$A$2:$B$250,2,FALSE),\"\")","v":""},{"$nulls":8},{"$f":"IF(Q21>0,VLOOKUP(Q21,Set!$D$2:$E$23,2,FALSE),\"\")","v":""}]
[{"$nulls":9},{"$f":"IF(I22>0,VLOOKUP(I22,Set!$A$2:$B$250,2,FALSE),\"\")","v":""},{"$nulls":8},{"$f":"IF(Q22>0,VLOOKUP(Q22,Set!$D$2:$E$23,2,FALSE),\"\")","v":""}]
[{"$nulls":9},{"$f":"IF(I23>0,VLOOKUP(I23,Set!$A$2:$B$250,2,FALSE),\"\")","v":""},{"$nulls":8},{"$f":"IF(Q23>0,VLOOKUP(Q23,Set!$D$2:$E$23,2,FALSE),\"\")","v":""}]
[{"$nulls":9},{"$f":"IF(I24>0,VLOOKUP(I24,Set!$A$2:$B$250,2,FALSE),\"\")","v":""},{"$nulls":8},{"$f":"IF(Q24>0,VLOOKUP(Q24,Set!$D$2:$E$23,2,FALSE),\"\")","v":""}]
[{"$nulls":9},{"$f":"IF(I25>0,VLOOKUP(I25,Set!$A$2:$B$250,2,FALSE),\"\")","v":""},{"$nulls":8},{"$f":"IF(Q25>0,VLOOKUP(Q25,Set!$D$2:$E$23,2,FALSE),\"\")","v":""}]
[{"$nulls":9},{"$f":"IF(I26>0,VLOOKUP(I26,Set!$A$2:$B$250,2,FALSE),\"\")","v":""},{"$nulls":8},{"$f":"IF(Q26>0,VLOOKUP(Q26,Set!$D$2:$E$23,2,FALSE),\"\")","v":""}]
[{"$nulls":9},{"$f":"IF(I27>0,VLOOKUP(I27,Set!$A$2:$B$250,2,FALSE),\"\")","v":""},{"$nulls":8},{"$f":"IF(Q27>0,VLOOKUP(Q27,Set!$D$2:$E$23,2,FALSE),\"\")","v":""}]
[{"$nulls":9},{"$f":"IF(I28>0,VLOOKUP(I28,Set!$A$2:$B$250,2,FALSE),\"\")","v":""},{"$nulls":8},{"$f":"IF(Q28>0,VLOOKUP(Q28,Set!$D$2:$E$23,2,FALSE),\"\")","v":""}]
[{"$nulls":9},{"$f":"IF(I29>0,VLOOKUP(I29,Set!$A$2:$B$250,2,FALSE),\"\")","v":""},{"$nulls":8},{"$f":"IF(Q29>0,VLOOKUP(Q29,Set!$D$2:$E$23,2,FALSE),\"\")","v":""}]
[{"$nulls":9},{"$f":"IF(I30>0,VLOOKUP(I30,Set!$A$2:$B$250,2,FALSE),\"\")","v":""},{"$nulls":8},{"$f":"IF(Q30>0,VLOOKUP(Q30,Set!$D$2:$E$23,2,FALSE),\"\")","v":""}]
[{"$nulls":9},{"$f":"IF(I31>0,VLOOKUP(I31,Set!$A$2:$B$250,2,FALSE),\"\")","v":""},{"$nulls":8},{"$f":"IF(Q31>0,VLOOKUP(Q31,Set!$D$2:$E$23,2,FALSE),\"\")","v":""}]
[{"$nulls":9},{"$f":"IF(I32>0,VLOOKUP(I32,Set!$A$2:$B$250,2,FALSE),\"\")","v":""},{"$nulls":8},{"$f":"IF(Q32>0,VLOOKUP(Q32,Set!$D$2:$E$23,2,FALSE),\"\")","v":""}]
[{"$nulls":9},{"$f":"IF(I33>0,VLOOKUP(I33,Set!$A$2:$B$250,2,FALSE),\"\")","v":""},{"$nulls":8},{"$f":"IF(Q33>0,VLOOKUP(Q33,Set!$D$2:$E$23,2,FALSE),\"\")","v":""}]
[{"$nulls":9},{"$f":"IF(I34>0,VLOOKUP(I34,Set!$A$2:$B$250,2,FALSE),\"\")","v":""},{"$nulls":8},{"$f":"IF(Q34>0,VLOOKUP(Q34,Set!$D$2:$E$23,2,FALSE),\"\")","v":""}]
[{"$nulls":9},{"$f":"IF(I35>0,VLOOKUP(I35,Set!$A$2:$B$250,2,FALSE),\"\")","v":""},{"$nulls":8},{"$f":"IF(Q35>0,VLOOKUP(Q35,Set!$D$2:$E$23,2,FALSE),\"\")","v":""}]
[{"$nulls":9},{"$f":"IF(I36>0,VLOOKUP(I36,Set!$A$2:$B$250,2,FALSE),\"\")","v":""},{"$nulls":8},{"$f":"IF(Q36>0,VLOOKUP(Q36,Set!$D$2:$E$23,2,FALSE),\"\")","v":""}]
[{"$nulls":9},{"$f":"IF(I37>0,VLOOKUP(I37,Set!$A$2:$B$250,2,FALSE),\"\")","v":""},{"$nulls":8},{"$f":"IF(Q37>0,VLOOKUP(Q37,Set!$D$2:$E$23,2,FALSE),\"\")","v":""}]
[{"$nulls":9},{"$f":"IF(I38>0,VLOOKUP(I38,Set!$A$2:$B$250,2,FALSE),\"\")","v":""},{"$nulls":8},{"$f":"IF(Q38>0,VLOOKUP(Q38,Set!$D$2:$E$23,2,FALSE),\"\")","v":""}]
[{"$nulls":9},{"$f":"IF(I39>0,VLOOKUP(I39,Set!$A$2:$B$250,2,FALSE),\"\")","v":""},{"$nulls":8},{"$f":"IF(Q39>0,VLOOKUP(Q39,Set!$D$2:$E$23,2,FALSE),\"\")","v":""}]
[{"$nulls":9},{"$f":"IF(I40>0,VLOOKUP(I40,Set!$A$2:$B$250,2,FALSE),\"\")","v":""},{"$nulls":8},{"$f":"IF(Q40>0,VLOOKUP(Q40,Set!$D$2:$E$23,2,FALSE),\"\")","v":""}]
[{"$nulls":9},{"$f":"IF(I41>0,VLOOKUP(I41,Set!$A$2:$B$250,2,FALSE),\"\")","v":""},{"$nulls":8},{"$f":"IF(Q41>0,VLOOKUP(Q41,Set!$D$2:$E$23,2,FALSE),\"\")","v":""}]
[{"$nulls":9},{"$f":"IF(I42>0,VLOOKUP(I42,Set!$A$2:$B$250,2,FALSE),\"\")","v":""},{"$nulls":8},{"$f":"IF(Q42>0,VLOOKUP(Q42,Set!$D$2:$E$23,2,FALSE),\"\")","v":""}]
[{"$nulls":9},{"$f":"IF(I43>0,VLOOKUP(I43,Set!$A$2:$B$250,2,FALSE),\"\")","v":""},{"$nulls":8},{"$f":"IF(Q43>0,VLOOKUP(Q43,Set!$D$2:$E$23,2,FALSE),\"\")","v":""}]
[{"$nulls":9},{"$f":"IF(I44>0,VLOOKUP(I44,Set!$A$2:$B$250,2,FALSE),\"\")","v":""},{"$nulls":8},{"$f":"IF(Q44>0,VLOOKUP(Q44,Set!$D$2:$E$23,2,FALSE),\"\")","v":""}]
[{"$nulls":9},{"$f":"IF(I45>0,VLOOKUP(I45,Set!$A$2:$B$250,2,FALSE),\"\")","v":""},{"$nulls":8},{"$f":"IF(Q45>0,VLOOKUP(Q45,Set!$D$2:$E$23,2,FALSE),\"\")","v":""}]
[{"$nulls":9},{"$f":"IF(I46>0,VLOOKUP(I46,Set!$A$2:$B$250,2,FALSE),\"\")","v":""},{"$nulls":8},{"$f":"IF(Q46>0,VLOOKUP(Q46,Set!$D$2:$E$23,2,FALSE),\"\")","v":""}]
[{"$nulls":9},{"$f":"IF(I47>0,VLOOKUP(I47,Set!$A$2:$B$250,2,FALSE),\"\")","v":""},{"$nulls":8},{"$f":"IF(Q47>0,VLOOKUP(Q47,Set!$D$2:$E$23,2,FALSE),\"\")","v":""}]
[{"$nulls":9},{"$f":"IF(I48>0,VLOOKUP(I48,Set!$A$2:$B$250,2,FALSE),\"\")","v":""},{"$nulls":8},{"$f":"IF(Q48>0,VLOOKUP(Q48,Set!$D$2:$E$23,2,FALSE),\"\")","v":""}]
[{"$nulls":9},{"$f":"IF(I49>0,VLOOKUP(I49,Set!$A$2:$B$250,2,FALSE),\"\")","v":""},{"$nulls":8},{"$f":"IF(Q49>0,VLOOKUP(Q49,Set!$D$2:$E$23,2,FALSE),\"\")","v":""}]
[{"$nulls":9},{"$f":"IF(I50>0,VLOOKUP(I50,Set!$A$2:$B$250,2,FALSE),\"\")","v":""},{"$nulls":8},{"$f":"IF(Q50>0,VLOOKUP(Q50,Set!$D$2:$E$23,2,FALSE),\"\")","v":""}]
[{"$nulls":9},{"$f":"IF(I51>0,VLOOKUP(I51,Set!$A$2:$B$250,2,FALSE),\"\")","v":""},{"$nulls":8},{"$f":"IF(Q51>0,VLOOKUP(Q51,Set!$D$2:$E$23,2,FALSE),\"\")","v":""}]
[{"$nulls":9},{"$f":"IF(I52>0,VLOOKUP(I52,Set!$A$2:$B$250,2,FALSE),\"\")","v":""},{"$nulls":8},{"$f":"IF(Q52>0,VLOOKUP(Q52,Set!$D$2:$E$23,2,FALSE),\"\")","v":""}]
[{"$nulls":9},{"$f":"IF(I53>0,VLOOKUP(I53,Set!$A$2:$B$250,2,FALSE),\"\")","v":""},{"$nulls":8},{"$f":"IF(Q53>0,VLOOKUP(Q53,Set!$D$2:$E$23,2,FALSE),\"\")","v":""}]
[{"$nulls":9},{"$f":"IF(I54>0,VLOOKUP(I54,Set!$A$2:$B$250,2,FALSE),\"\")","v":""},{"$nulls":8},{"$f":"IF(Q54>0,VLOOKUP(Q54,Set!$D$2:$E$23,2,FALSE),\"\")","v":""}]
[{"$nulls":9},{"$f":"IF(I55>0,VLOOKUP(I55,Set!$A$2:$B$250,2,FALSE),\"\")","v":""},{"$nulls":8},{"$f":"IF(Q55>0,VLOOKUP(Q55,Set!$D$2:$E$23,2,FALSE),\"\")","v":""}]
[{"$nulls":9},{"$f":"IF(I56>0,VLOOKUP(I56,Set!$A$2:$B$250,2,FALSE),\"\")","v":""},{"$nulls":8},{"$f":"IF(Q56>0,VLOOKUP(Q56,Set!$D$2:$E$23,2,FALSE),\"\")","v":""}]
[{"$nulls":9},{"$f":"IF(I57>0,VLOOKUP(I57,Set!$A$2:$B$250,2,FALSE),\"\")","v":""},{"$nulls":8},{"$f":"IF(Q57>0,VLOOKUP(Q57,Set!$D$2:$E$23,2,FALSE),\"\")","v":""}]
[{"$nulls":9},{"$f":"IF(I58>0,VLOOKUP(I58,Set!$A$2:$B$250,2,FALSE),\"\")","v":""},{"$nulls":8},{"$f":"IF(Q58>0,VLOOKUP(Q58,Set!$D$2:$E$23,2,FALSE),\"\")","v":""}]
[{"$nulls":9},{"$f":"IF(I59>0,VLOOKUP(I59,Set!$A$2:$B$250,2,FALSE),\"\")","v":""},{"$nulls":8},{"$f":"IF(Q59>0,VLOOKUP(Q59,Set!$D$2:$E$23,2,FALSE),\"\")","v":""}]
[{"$nulls":9},{"$f":"IF(I60>0,VLOOKUP(I60,Set!$A$2:$B$250,2,FALSE),\"\")","v":""},{"$nulls":8},{"$f":"IF(Q60>0,VLOOKUP(Q60,Set!$D$2:$E$23,2,FALSE),\"\")","v":""}]
[{"$nulls":9},{"$f":"IF(I61>0,VLOOKUP(I61,Set!$A$2:$B$250,2,FALSE),\"\")","v":""},{"$nulls":8},{"$f":"IF(Q61>0,VLOOKUP(Q61,Set!$D$2:$E$23,2,FALSE),\"\")","v":""}]
[{"$nulls":9},{"$f":"IF(I62>0,VLOOKUP(I62,Set!$A$2:$B$250,2,FALSE),\"\")","v":""},{"$nulls":8},{"$f":"IF(Q62>0,VLOOKUP(Q62,Set!$D$2:$E$23,2,FALSE),\"\")","v":""}]
[{"$nulls":9},{"$f":"IF(I63>0,VLOOKUP(I63,Set!$A$2:$B$250,2,FALSE),\"\")","v":""},{"$nulls":8},{"$f":"IF(Q63>0,VLOOKUP(Q63,Set!$D$2:$E$23,2,FALSE),\"\")","v":""}]
[{"$nulls":9},{"$f":"IF(I64>0,VLOOKUP(I64,Set!$A$2:$B$250,2,FALSE),\"\")","v":""},{"$nulls":8},{"$f":"IF(Q64>0,VLOOKUP(Q64,Set!$D$2:$E$23,2,FALSE),\"\")","v":""}]
[{"$nulls":9},{"$f":"IF(I65>0,VLOOKUP(I65,Set!$A$2:$B$250,2,FALSE),\"\")","v":""},{"$nulls":8},{"$f":"IF(Q65>0,VLOOKUP(Q65,Set!$D$2:$E$23,2,FALSE),\"\")","v":""}]
[{"$nulls":9},{"$f":"IF(I66>0,VLOOKUP(I66,Set!$A$2:$B$250,2,FALSE),\"\")","v":""},{"$nulls":8},{"$f":"IF(Q66>0,VLOOKUP(Q66,Set!$D$2:$E$23,2,FALSE),\"\")","v":""}]
[{"$nulls":9},{"$f":"IF(I67>0,VLOOKUP(I67,Set!$A$2:$B$250,2,FALSE),\"\")","v":""},{"$nulls":8},{"$f":"IF(Q67>0,VLOOKUP(Q67,Set!$D$2:$E$23,2,FALSE),\"\")","v":""}]
[{"$nulls":9},{"$f":"IF(I68>0,VLOOKUP(I68,Set!$A$2:$B$250,2,FALSE),\"\")","v":""},{"$nulls":8},{"$f":"IF(Q68>0,VLOOKUP(Q68,Set!$D$2:$E$23,2,FALSE),\"\")","v":""}]
[{"$nulls":9},{"$f":"IF(I69>0,VLOOKUP(I69,Set!$A$2:$B$250,2,FALSE),\"\")","v":""},{"$nulls":8},{"$f":"IF(Q69>0,VLOOKUP(Q69,Set!$D$2:$E$23,2,FALSE),\"\")","v":""}]
[{"$nulls":9},{"$f":"IF(I70>0,VLOOKUP(I70,Set!$A$2:$B$250,2,FALSE),\"\")","v":""},{"$nulls":8},{"$f":"IF(Q70>0,VLOOKUP(Q70,Set!$D$2:$E$23,2,FALSE),\"\")","v":""}]
[{"$nulls":9},{"$f":"IF(I71>0,VLOOKUP(I71,Set!$A$2:$B$250,2,FALSE),\"\")","v":""},{"$nulls":8},{"$f":"IF(Q71>0,VLOOKUP(Q71,Set!$D$2:$E$23,2,FALSE),\"\")","v":""}]
[{"$nulls":9},{"$f":"IF(I72>0,VLOOKUP(I72,Set!$A$2:$B$250,2,FALSE),\"\")","v":""},{"$nulls":8},{"$f":"IF(Q72>0,VLOOKUP(Q72,Set!$D$2:$E$23,2,FALSE),\"\")","v":""}]
[{"$nulls":9},{"$f":"IF(I73>0,VLOOKUP(I73,Set!$A$2:$B$250,2,FALSE),\"\")","v":""},{"$nulls":8},{"$f":"IF(Q73>0,VLOOKUP(Q73,Set!$D$2:$E$23,2,FALSE),\"\")","v":""}]
[{"$nulls":9},{"$f":"IF(I74>0,VLOOKUP(I74,Set!$A$2:$B$250,2,FALSE),\"\")","v":""},{"$nulls":8},{"$f":"IF(Q74>0,VLOOKUP(Q74,Set!$D$2:$E$23,2,FALSE),\"\")","v":""}]
[{"$nulls":9},{"$f":"IF(I75>0,VLOOKUP(I75,Set!$A$2:$B$250,2,FALSE),\"\")","v":""},{"$nulls":8},{"$f":"IF(Q75>0,VLOOKUP(Q75,Set!$D$2:$E$23,2,FALSE),\"\")","v":""}]
[{"$nulls":9},{"$f":"IF(I76>0,VLOOKUP(I76,Set!$A$2:$B$250,2,FALSE),\"\")","v":""},{"$nulls":8},{"$f":"IF(Q76>0,VLOOKUP(Q76,Set!$D$2:$E$23,2,FALSE),\"\")","v":""}]
[{"$nulls":9},{"$f":"IF(I77>0,VLOOKUP(I77,Set!$A$2:$B$250,2,FALSE),\"\")","v":""},{"$nulls":8},{"$f":"IF(Q77>0,VLOOKUP(Q77,Set!$D$2:$E$23,2,FALSE),\"\")","v":""}]
[{"$nulls":9},{"$f":"IF(I78>0,VLOOKUP(I78,Set!$A$2:$B$250,2,FALSE),\"\")","v":""},{"$nulls":8},{"$f":"IF(Q78>0,VLOOKUP(Q78,Set!$D$2:$E$23,2,FALSE),\"\")","v":""}]
[{"$nulls":9},{"$f":"IF(I79>0,VLOOKUP(I79,Set!$A$2:$B$250,2,FALSE),\"\")","v":""},{"$nulls":8},{"$f":"IF(Q79>0,VLOOKUP(Q79,Set!$D$2:$E$23,2,FALSE),\"\")","v":""}]
[{"$nulls":9},{"$f":"IF(I80>0,VLOOKUP(I80,Set!$A$2:$B$250,2,FALSE),\"\")","v":""},{"$nulls":8},{"$f":"IF(Q80>0,VLOOKUP(Q80,Set!$D$2:$E$23,2,FALSE),\"\")","v":""}]
[{"$nulls":9},{"$f":"IF(I81>0,VLOOKUP(I81,Set!$A$2:$B$250,2,FALSE),\"\")","v":""},{"$nulls":8},{"$f":"IF(Q81>0,VLOOKUP(Q81,Set!$D$2:$E$23,2,FALSE),\"\")","v":""}]
[{"$nulls":9},{"$f":"IF(I82>0,VLOOKUP(I82,Set!$A$2:$B$250,2,FALSE),\"\")","v":""},{"$nulls":8},{"$f":"IF(Q82>0,VLOOKUP(Q82,Set!$D$2:$E$23,2,FALSE),\"\")","v":""}]
[{"$nulls":9},{"$f":"IF(I83>0,VLOOKUP(I83,Set!$A$2:$B$250,2,FALSE),\"\")","v":""},{"$nulls":8},{"$f":"IF(Q83>0,VLOOKUP(Q83,Set!$D$2:$E$23,2,FALSE),\"\")","v":""}]
[{"$nulls":9},{"$f":"IF(I84>0,VLOOKUP(I84,Set!$A$2:$B$250,2,FALSE),\"\")","v":""},{"$nulls":8},{"$f":"IF(Q84>0,VLOOKUP(Q84,Set!$D$2:$E$23,2,FALSE),\"\")","v":""}]
[{"$nulls":9},{"$f":"IF(I85>0,VLOOKUP(I85,Set!$A$2:$B$250,2,FALSE),\"\")","v":""},{"$nulls":8},{"$f":"IF(Q85>0,VLOOKUP(Q85,Set!$D$2:$E$23,2,FALSE),\"\")","v":""}]
[{"$nulls":9},{"$f":"IF(I86>0,VLOOKUP(I86,Set!$A$2:$B$250,2,FALSE),\"\")","v":""},{"$nulls":8},{"$f":"IF(Q86>0,VLOOKUP(Q86,Set!$D$2:$E$23,2,FALSE),\"\")","v":""}]
[{"$nulls":9},{"$f":"IF(I87>0,VLOOKUP(I87,Set!$A$2:$B$250,2,FALSE),\"\")","v":""},{"$nulls":8},{"$f":"IF(Q87>0,VLOOKUP(Q87,Set!$D$2:$E$23,2,FALSE),\"\")","v":""}]
[{"$nulls":9},{"$f":"IF(I88>0,VLOOKUP(I88,Set!$A$2:$B$250,2,FALSE),\"\")","v":""},{"$nulls":8},{"$f":"IF(Q88>0,VLOOKUP(Q88,Set!$D$2:$E$23,2,FALSE),\"\")","v":""}]
[{"$nulls":9},{"$f":"IF(I89>0,VLOOKUP(I89,Set!$A$2:$B$250,2,FALSE),\"\")","v":""},{"$nulls":8},{"$f":"IF(Q89>0,VLOOKUP(Q89,Set!$D$2:$E$23,2,FALSE),\"\")","v":""}]
[{"$nulls":9},{"$f":"IF(I90>0,VLOOKUP(I90,Set!$A$2:$B$250,2,FALSE),\"\")","v":""},{"$nulls":8},{"$f":"IF(Q90>0,VLOOKUP(Q90,Set!$D$2:$E$23,2,FALSE),\"\")","v":""}]
[{"$nulls":9},{"$f":"IF(I91>0,VLOOKUP(I91,Set!$A$2:$B$250,2,FALSE),\"\")","v":""},{"$nulls":8},{"$f":"IF(Q91>0,VLOOKUP(Q91,Set!$D$2:$E$23,2,FALSE),\"\")","v":""}]
[{"$nulls":9},{"$f":"IF(I92>0,VLOOKUP(I92,Set!$A$2:$B$250,2,FALSE),\"\")","v":""},{"$nulls":8},{"$f":"IF(Q92>0,VLOOKUP(Q92,Set!$D$2:$E$23,2,FALSE),\"\")","v":""}]
[{"$nulls":9},{"$f":"IF(I93>0,VLOOKUP(I93,Set!$A$2:$B$250,2,FALSE),\"\")","v":""},{"$nulls":8},{"$f":"IF(Q93>0,VLOOKUP(Q93,Set!$D$2:$E$23,2,FALSE),\"\")","v":""}]
[{"$nulls":9},{"$f":"IF(I94>0,VLOOKUP(I94,Set!$A$2:$B$250,2,FALSE),\"\")","v":""},{"$nulls":8},{"$f":"IF(Q94>0,VLOOKUP(Q94,Set!$D$2:$E$23,2,FALSE),\"\")","v":""}]
[{"$nulls":9},{"$f":"IF(I95>0,VLOOKUP(I95,Set!$A$2:$B$250,2,FALSE),\"\")","v":""},{"$nulls":8},{"$f":"IF(Q95>0,VLOOKUP(Q95,Set!$D$2:$E$23,2,FALSE),\"\")","v":""}]
[{"$nulls":9},{"$f":"IF(I96>0,VLOOKUP(I96,Set!$A$2:$B$250,2,FALSE),\"\")","v":""},{"$nulls":8},{"$f":"IF(Q96>0,VLOOKUP(Q96,Set!$D$2:$E$23,2,FALSE),\"\")","v":""}]
[{"$nulls":9},{"$f":"IF(I97>0,VLOOKUP(I97,Set!$A$2:$B$250,2,FALSE),\"\")","v":""},{"$nulls":8},{"$f":"IF(Q97>0,VLOOKUP(Q97,Set!$D$2:$E$23,2,FALSE),\"\")","v":""}]
[{"$nulls":9},{"$f":"IF(I98>0,VLOOKUP(I98,Set!$A$2:$B$250,2,FALSE),\"\")","v":""},{"$nulls":8},{"$f":"IF(Q98>0,VLOOKUP(Q98,Set!$D$2:$E$23,2,FALSE),\"\")","v":""}]
[{"$nulls":9},{"$f":"IF(I99>0,VLOOKUP(I99,Set!$A$2:$B$250,2,FALSE),\"\")","v":""},{"$nulls":8},{"$f":"IF(Q99>0,VLOOKUP(Q99,Set!$D$2:$E$23,2,FALSE),\"\")","v":""}]
[{"$nulls":9},{"$f":"IF(I100>0,VLOOKUP(I100,Set!$A$2:$B$250,2,FALSE),\"\")","v":""},{"$nulls":8},{"$f":"IF(Q100>0,VLOOKUP(Q100,Set!$D$2:$E$23,2,FALSE),\"\")","v":""}]
[{"$nulls":9},{"$f":"IF(I101>0,VLOOKUP(I101,Set!$A$2:$B$250,2,FALSE),\"\")","v":""},{"$nulls":8},{"$f":"IF(Q101>0,VLOOKUP(Q101,Set!$D$2:$E$23,2,FALSE),\"\")","v":""}]
[{"$nulls":9},{"$f":"IF(I102>0,VLOOKUP(I102,Set!$A$2:$B$250,2,FALSE),\"\")","v":""},{"$nulls":8},{"$f":"IF(Q102>0,VLOOKUP(Q102,Set!$D$2:$E$23,2,FALSE),\"\")","v":""}]
[{"$nulls":9},{"$f":"IF(I103>0,VLOOKUP(I103,Set!$A$2:$B$250,2,FALSE),\"\")","v":""},{"$nulls":8},{"$f":"IF(Q103>0,VLOOKUP(Q103,Set!$D$2:$E$23,2,FALSE),\"\")","v":""}]
[{"$nulls":9},{"$f":"IF(I104>0,VLOOKUP(I104,Set!$A$2:$B$250,2,FALSE),\"\")","v":""},{"$nulls":8},{"$f":"IF(Q104>0,VLOOKUP(Q104,Set!$D$2:$E$23,2,FALSE),\"\")","v":""}]
[{"$nulls":9},{"$f":"IF(I105>0,VLOOKUP(I105,Set!$A$2:$B$250,2,FALSE),\"\")","v":""},{"$nulls":8},{"$f":"IF(Q105>0,VLOOKUP(Q105,Set!$D$2:$E$23,2,FALSE),\"\")","v":""}]
[{"$nulls":9},{"$f":"IF(I106>0,VLOOKUP(I106,Set!$A$2:$B$250,2,FALSE),\"\")","v":""},{"$nulls":8},{"$f":"IF(Q106>0,VLOOKUP(Q106,Set!$D$2:$E$23,2,FALSE),\"\")","v":""}]
[{"$nulls":9},{"$f":"IF(I107>0,VLOOKUP(I107,Set!$A$2:$B$250,2,FALSE),\"\")","v":""},{"$nulls":8},{"$f":"IF(Q107>0,VLOOKUP(Q107,Set!$D$2:$E$23,2,FALSE),\"\")","v":""}]
[{"$nulls":9},{"$f":"IF(I108>0,VLOOKUP(I108,Set!$A$2:$B$250,2,FALSE),\"\")","v":""},{"$nulls":8},{"$f":"IF(Q108>0,VLOOKUP(Q108,Set!$D$2:$E$23,2,FALSE),\"\")","v":""}]
[{"$nulls":9},{"$f":"IF(I109>0,VLOOKUP(I109,Set!$A$2:$B$250,2,FALSE),\"\")","v":""},{"$nulls":8},{"$f":"IF(Q109>0,VLOOKUP(Q109,Set!$D$2:$E$23,2,FALSE),\"\")","v":""}]
[{"$nulls":9},{"$f":"IF(I110>0,VLOOKUP(I110,Set!$A$2:$B$250,2,FALSE),\"\")","v":""},{"$nulls":8},{"$f":"IF(Q110>0,VLOOKUP(Q110,Set!$D$2:$E$23,2,FALSE),\"\")","v":""}]
[{"$nulls":9},{"$f":"IF(I111>0,VLOOKUP(I111,Set!$A$2:$B$250,2,FALSE),\"\")","v":""},{"$nulls":8},{"$f":"IF(Q111>0,VLOOKUP(Q111,Set!$D$2:$E$23,2,FALSE),\"\")","v":""}]
[{"$nulls":9},{"$f":"IF(I112>0,VLOOKUP(I112,Set!$A$2:$B$250,2,FALSE),\"\")","v":""},{"$nulls":8},{"$f":"IF(Q112>0,VLOOKUP(Q112,Set!$D$2:$E$23,2,FALSE),\"\")","v":""}]
[{"$nulls":9},{"$f":"IF(I113>0,VLOOKUP(I113,Set!$A$2:$B$250,2,FALSE),\"\")","v":""},{"$nulls":8},{"$f":"IF(Q113>0,VLOOKUP(Q113,Set!$D$2:$E$23,2,FALSE),\"\")","v":""}]
[{"$nulls":9},{"$f":"IF(I114>0,VLOOKUP(I114,Set!$A$2:$B$250,2,FALSE),\"\")","v":""},{"$nulls":8},{"$f":"IF(Q114>0,VLOOKUP(Q114,Set!$D$2:$E$23,2,FALSE),\"\")","v":""}]
[{"$nulls":9},{"$f":"IF(I115>0,VLOOKUP(I115,Set!$A$2:$B$250,2,FALSE),\"\")","v":""},{"$nulls":8},{"$f":"IF(Q115>0,VLOOKUP(Q115,Set!$D$2:$E$23,2,FALSE),\"\")","v":""}]
[{"$nulls":9},{"$f":"IF(I116>0,VLOOKUP(I116,Set!$A$2:$B$250,2,FALSE),\"\")","v":""},{"$nulls":8},{"$f":"IF(Q116>0,VLOOKUP(Q116,Set!$D$2:$E$23,2,FALSE),\"\")","v":""}]
[{"$nulls":9},{"$f":"IF(I117>0,VLOOKUP(I117,Set!$A$2:$B$250,2,FALSE),\"\")","v":""},{"$nulls":8},{"$f":"IF(Q117>0,VLOOKUP(Q117,Set!$D$2:$E$23,2,FALSE),\"\")","v":""}]
[{"$nulls":9},{"$f":"IF(I118>0,VLOOKUP(I118,Set!$A$2:$B$250,2,FALSE),\"\")","v":""},{"$nulls":8},{"$f":"IF(Q118>0,VLOOKUP(Q118,Set!$D$2:$E$23,2,FALSE),\"\")","v":""}]
[{"$nulls":9},{"$f":"IF(I119>0,VLOOKUP(I119,Set!$A$2:$B$250,2,FALSE),\"\")","v":""},{"$nulls":8},{"$f":"IF(Q119>0,VLOOKUP(Q119,Set!$D$2:$E$23,2,FALSE),\"\")","v":""}]
[{"$nulls":9},{"$f":"IF(I120>0,VLOOKUP(I120,Set!$A$2:$B$250,2,FALSE),\"\")","v":""},{"$nulls":8},{"$f":"IF(Q120>0,VLOOKUP(Q120,Set!$D$2:$E$23,2,FALSE),\"\")","v":""}]
{"$rows_left_out":920}
{"sheet":"Set","index":1,"n_rows":250,"n_cols":9,"rows_kept":250,"cut":false,"hidden":true,"merged":[]}
["Valsts","Valsts kods",null,"Banka","Bankas kods",null,"Jā / Nē vērtības",null,"Samaksas dienas"]
["Andora","AD",null,"ABLV Bank AS","AIZKLV",null,"Jā",null,"00"]
["Apvienotie Arābu Emirāti","AE",null,"GE Money Bank AS","BATRLV",null,"Nē",null,"01"]
["Afganistāna","AF",null,"SEB bankas AB","CBVILT",null,null,null,"02"]
["Antigva un Barbuda","AG",null,"Dresdner bank AG","DRESNL",null,null,null,"03"]
["Angilja","AI",null,"Paysera LT UAB","EVIULT",null,null,null,"04"]
["Albānija","AL",null,"Hansapank","HABAEE",null,null,null,"05"]
["Armēnija","AM",null,"Swedbanka AS","HABALV",null,null,null,"06"]
["Angola","AO",null,"Hamburger Sparkasse","HASPDE",null,null,null,"07"]
["Antarktika","AQ",null,"Latvijas pasta banka","LAPBLV",null,null,null,"08"]
["Argentīna","AR",null,"Norvik banka AS","LATBLV",null,null,null,"09"]
["Amerikāņu Samoa","AS",null,"Danske Bank A/S filiāle Latvijā","MARALV",null,null,null,"10"]
["Austrija","AT",null,"Meridian Trade Bank AS","MULTLV",null,null,null,"11"]
["Austrālija","AU",null,"Luminor banka (Nordea)","NDEALV",null,null,null,"12"]
["Aruba","AW",null,"Pohjola Bank plc filiāle Latvijā","OKOYLV",null,null,null,"13"]
["Olande","AX",null,"Citadele banka AS","PARXLV",null,null,null,"14"]
["Azerbaidžāna","AZ",null,"Spoldzielczy W Lubeni Bank","POLUPL",null,null,null,"15"]
["Bosnija un Hercegovina","BA",null,"Privat bank AS","PRTTLV",null,null,null,"16"]
["Barbadosa","BB",null,"Luminor banka (DNB)","RIKOLV",null,null,null,"17"]
["Bangladeša","BD",null,"Rietumu Banka AS","RTMBLV",null,null,null,"18"]
["Beļģija","BE",null,"Stadtsparkasse Muenchen","SSKMDE",null,null,null,"19"]
["Burkinafaso","BF",null,"Valsts kase","TRELLV",null,null,null,"20"]
["Bulgārija","BG",null,"SEB banka AS","UNLALV",null,null,null,"21"]
["Bahreina","BH",{"$nulls":6},"30"]
["Burundi","BI"]
["Baltkrievija","BY"]
["Benina","BJ"]
["Senbartelmī","BL"]
["Bermuda","BM"]
["Bruneja","BN"]
["Bolīvija","BO"]
["Bonaire, Sintēstatiusa un Saba[a]","BQ"]
["Brazīlija","BR"]
["Bahamas","BS"]
["Butāna","BT"]
["Buvē Sala","BV"]
["Botsvana","BW"]
["Beliza","BZ"]
["Kanāda","CA"]
["Kokosu (Kīlinga) Salas","CC"]
["Kongo Demokrātiskā Republika","CD"]
["Centrālāfrikas Republika","CF"]
["Kongo","CG"]
["Šveice","CH"]
["Kotdivuāra","CI"]
["Kipra","CY"]
["Kuka Salas","CK"]
["Čīle","CL"]
["Kamerūna","CM"]
["Ķīna","CN"]
["Kolumbija","CO"]
["Kostarika","CR"]
["Kuba","CU"]
["Kaboverde","CV"]
["Kirasao","CW"]
["Ziemsvētku Sala","CX"]
["Čehija","CZ"]
["Vācija","DE"]
["Džibutija","DJ"]
["Dānija","DK"]
["Dominika","DM"]
["Dominikāna","DO"]
["Alžīrija","DZ"]
["Ekvadora","EC"]
["Igaunija","EE"]
["Ēģipte","EG"]
["Rietumsahāra","EH"]
["Eritreja","ER"]
["Spānija","ES"]
["Etiopija","ET"]
["Somija","FI"]
["Fidži","FJ"]
["Folklenda Salas","FK"]
["Mikronēzija","FM"]
["Fēru Salas","FO"]
["Francija","FR"]
["Gabona","GA"]
["Lielbritānija","GB"]
["Grenāda","GD"]
["Gruzija","GE"]
["Gviāna","GF"]
["Gērnsija","GG"]
["Gana","GH"]
["Gibraltārs","GI"]
["Gajāna","GY"]
["Grenlande","GL"]
["Gambija","GM"]
["Gvineja","GN"]
["Gvadelupa","GP"]
["Ekvatoriālā Gvineja","GQ"]
["Grieķija","GR"]
["Dienviddžordžija un Dienvidsendviču Salas","GS"]
["Gvatemala","GT"]
["Guama","GU"]
["Gvineja-Bisava","GW"]
["Honkonga (Sjangana)","HK"]
["Hērda Sala un Makdonalda Salas","HM"]
["Hondurasa","HN"]
["Horvātija","HR"]
["Haiti","HT"]
["Ungārija","HU"]
["Indonēzija","ID"]
["Īrija","IE"]
["Jemena","YE"]
["Izraēla","IL"]
["Mena","IM"]
["Indija","IN"]
["Indijas Okeāna Britu Teritorija","IO"]
["Irāka","IQ"]
["Irāna","IR"]
["Īslande","IS"]
["Itālija","IT"]
["Majota","YT"]
["Džērsija","JE"]
["Jamaika","JM"]
["Jordānija","JO"]
["Japāna","JP"]
["Kenija","KE"]
["Kirgizstāna","KG"]
["Kambodža","KH"]
{"$rows_left_out":130}